{"text_format":"1","workbook":"xlsx","n_sheets":7,"sheets":["Instructions","Meta data_sheet","Meta data_lookup","Raw data_format","Raw data_sheet","24hr_PM10_chart","24hr_PM2.5_chart"],"not_rendered":{"charts":4,"images":0,"macros":1,"external_links":0,"defined_names":15,"comments":0,"pivot_tables":0},"unopened":[{"sheet":"24hr_PM10_chart","index":5,"reason":"not_a_worksheet"},{"sheet":"24hr_PM2.5_chart","index":6,"reason":"not_a_worksheet"}],"bounds":{"document_bytes":16777216,"sheet_cells":100000,"rows_first":2000,"rows_last":500,"rows_between":2000,"halvings":0,"cell_chars":16384,"cell_head_chars":4096},"cells_cut":0,"cells_raw":0,"read":"whole","date_system":"1900"}

{"sheet":"Instructions","index":0,"n_rows":0,"n_cols":0,"rows_kept":0,"cut":false,"hidden":false,"merged":[]}

{"sheet":"Meta data_sheet","index":1,"n_rows":17,"n_cols":5,"rows_kept":17,"cut":false,"hidden":false,"merged":[[18,0,18,1],[16,0,16,1]]}
["Ambient Monitoring Station","Details",null,"Ambient Monitoring Results","Details"]
["Location","Will-gai",null,"PM2.5 monitoring start (dd/mm/yyyy hh:mm)","2024-03-01"]
["Easting",{"$f":"VLOOKUP($B$2,'Meta data_lookup'!$A$2:$D$5,2,FALSE)","v":231804},null,"PM2.5 monitoring end","2024-04-01"]
["Northing",{"$f":"VLOOKUP($B$2,'Meta data_lookup'!$A$2:$D$5,3,FALSE)","v":6596392},null,"PM2.5 monitoring period (h)",{"$f":"(E3-E2)*24","v":744}]
["Site elevation (m)",{"$f":"VLOOKUP($B$2,'Meta data_lookup'!$A$2:$D$5,4,FALSE)","v":294},null,"Number of valid PM2.5 results",{"$f":"COUNTIF('Raw data_sheet'!G2:G745,\"Valid\")","v":739}]
["Description of surrounding land use","Agriculture/Mining",null,"Proportion of valid PM2.5 results (%)",{"$f":"E5/E4","v":0.99327956989247312}]
["Typical sources impacting on the site","Agriculture",null,"PM10 monitoring start (dd/mm/yyyy hh:mm)","2024-03-01"]
["Site compliance with AS/NZS 3580.1.1:2007","Yes",null,"PM10 monitoring end","2024-04-01"]
["PM2.5 method compliance with AS/NZS 3580.9.13:2013\n","Yes",null,"PM10 monitoring period (h)",{"$f":"(E8-E7)*24","v":744}]
["PM2.5 instrument make","Thermo Scientific",null,"Number of valid PM10 results",{"$f":"COUNTIF('Raw data_sheet'!J2:J745,\"Valid\")","v":739}]
["PM2.5 instrument model","1405DF",null,"Proportion of valid PM10 results (%)",{"$f":"E10/E9","v":0.99327956989247312}]
["PM2.5 instrument intake height (m)",3.5]
["PM10 method compliance with AS 3580.9.8-2008\n","No*"]
["PM10 instrument make","Thermo Scientific"]
["PM10 instrument model","1405DF"]
["PM10 instrument intake height (m)",3.5]
["*The 1405DF TEOM used at this site measures PM10 indirectly rather than directly. The unit does however meet the intent of AS 3580.9.8-2008, and this method has been accredited by the USEPA. It is considered scientifically robust and is used extensively throughout NSW with EPA's knowledge and informal acceptance."]

{"sheet":"Meta data_lookup","index":2,"n_rows":5,"n_cols":4,"rows_kept":5,"cut":false,"hidden":false,"merged":[]}
["Location","Easting","Northing","Site elevation (m)"]
["Maules Creek",225302,6623037,"ND"]
["Breeza",237993,6542606,"ND"]
["Will-gai",231804,6596392,294]
["Werris Creek",276783,6528734,362]

{"sheet":"Raw data_format","index":3,"n_rows":8,"n_cols":6,"rows_kept":8,"cut":false,"hidden":false,"merged":[]}
["Parameter","Format","Comment","Units of measure","Minimum","Maximum"]
["Year","yyyy","4 integer format","Not applicable",2015,"Until reporting ceases"]
["Month","mm","2 integer format","Not applicable",1,12]
["Day","dd","2 integer format","Not applicable",1,31]
["Hour","hh","2 integer format","Not applicable",0,23]
["PM10",0,"1 decimal place resolution","µg/m3","Negative","Instrument specific"]
["PM2.5",0,"2 decimal place resolution","µg/m3","Negative","Instrument specific"]
["Status","Text","7 character format","Not applicable","Valid","Invalid"]

{"sheet":"Raw data_sheet","index":4,"n_rows":745,"n_cols":21,"rows_kept":745,"cut":false,"hidden":false,"merged":[]}
["Year","Month","Day","Hour","Date and time","PM2.5_hourly","PM2.5_Data_Status","PM2.5_24hr_rolling_average","PM10_hourly","PM10_Data_Status","PM10_24hr_rolling_average",null,null,"PM2.5_hourly_valid_plot","PM2.5_24hr_rolling_ave_valid_plot","PM10_hourly_valid_plot","PM10_24hr_rolling_ave_valid_plot","PM10_hourly_valid_plot_series","PM10_24hr_rolling_average_valid_plot_series","PM2.5_hourly_valid_plot_series","PM2.5_24hr_rolling_average_valid_plot_series"]
[2024,3,1,0,{"$f":"DATE(A2,B2,C2)+TIME(D2,0,0)","v":45352},3.18,"Valid",6.631666666666665,7.24,"Valid",13.365416666666668,"","",{"$f":"IF(G2=\"Valid\", F2, NA())","v":3.18},{"$f":"IF(G2=\"Valid\", H2, NA())","v":6.631666666666665},{"$f":"IF(J2=\"Valid\", I2, NA())","v":7.24},{"$f":"IF(J2=\"Valid\", K2, NA())","v":13.365416666666668},7.24,13.365416666666668,3.18,6.631666666666665]
[2024,3,{"$f":"C2","v":1},{"$f":"IF(D2=23,0,D2+1)","v":1},{"$f":"E2+0.0416666666666666","v":45352.041666666664},2.48,"Valid",6.5049999999999981,5.75,"Valid",13.173750000000004,"","",2.48,6.5049999999999981,5.75,13.173750000000004,5.75,13.173750000000004,2.48,6.5049999999999981]
[2024,3,{"$f":"C3","v":1},{"$f":"IF(D3=23,0,D3+1)","v":2},{"$f":"E3+0.0416666666666666","v":45352.083333333328},4.32,"Valid",6.4154166666666654,8.31,"Valid",13.077083333333334,"","",4.32,6.4154166666666654,8.31,13.077083333333334,8.31,13.077083333333334,4.32,6.4154166666666654]
[2024,3,1,3,45352.124999999993,5.58,"Valid",6.3570833333333328,10.76,"Valid",13.106250000000001,"","",5.58,6.3570833333333328,10.76,13.106250000000001,10.76,13.106250000000001,5.58,6.3570833333333328]
[2024,3,1,4,45352.166666666657,6.01,"Valid",6.367916666666666,9.4600000000000009,"Valid",13.127083333333331,"","",6.01,6.367916666666666,9.4600000000000009,13.127083333333331,9.4600000000000009,13.127083333333331,6.01,6.367916666666666]
[2024,3,1,5,45352.208333333321,3.1,"Valid",6.2404166666666656,6.05,"Valid",13.007916666666667,"","",3.1,6.2404166666666656,6.05,13.007916666666667,6.05,13.007916666666667,3.1,6.2404166666666656]
[2024,3,1,6,45352.249999999985,6.68,"Valid",6.0179166666666681,25.97,"Valid",12.871249999999998,"","",6.68,6.0179166666666681,25.97,12.871249999999998,25.97,12.871249999999998,6.68,6.0179166666666681]
[2024,3,1,7,45352.29166666665,7.29,"Valid",6.0095833333333344,17.239999999999998,"Valid",13.127499999999998,"","",7.29,6.0095833333333344,17.239999999999998,13.127499999999998,17.239999999999998,13.127499999999998,7.29,6.0095833333333344]
[2024,3,1,8,45352.333333333314,6.81,"Valid",6.0608333333333348,15.76,"Valid",13.390416666666667,"","",6.81,6.0608333333333348,15.76,13.390416666666667,15.76,13.390416666666667,6.81,6.0608333333333348]
[2024,3,1,9,45352.374999999978,6.51,"Valid",5.963750000000001,12.13,"Valid",13.233750000000001,"","",6.51,5.963750000000001,12.13,13.233750000000001,12.13,13.233750000000001,6.51,5.963750000000001]
[2024,3,1,10,45352.416666666642,3.73,"Valid",5.9041666666666659,11.19,"Valid",13.207916666666668,"","",3.73,5.9041666666666659,11.19,13.207916666666668,11.19,13.207916666666668,3.73,5.9041666666666659]
[2024,3,1,11,45352.458333333307,4.87,"Valid",5.859583333333334,12.51,"Valid",13.174999999999999,"","",4.87,5.859583333333334,12.51,13.174999999999999,12.51,13.174999999999999,4.87,5.859583333333334]
[2024,3,1,12,45352.499999999971,9.64,"Valid",5.7891666666666666,17.62,"Valid",13.141250000000001,"","",9.64,5.7891666666666666,17.62,13.141250000000001,17.62,13.141250000000001,9.64,5.7891666666666666]
[2024,3,1,13,45352.541666666635,6.37,"Valid",5.7100000000000009,10.02,"Valid",12.861666666666666,"","",6.37,5.7100000000000009,10.02,12.861666666666666,10.02,12.861666666666666,6.37,5.7100000000000009]
[2024,3,1,14,45352.583333333299,3.27,"Valid",5.4712500000000013,7.13,"Valid",12.429166666666667,"","",3.27,5.4712500000000013,7.13,12.429166666666667,7.13,12.429166666666667,3.27,5.4712500000000013]
[2024,3,1,15,45352.624999999964,4.67,"Valid",5.370000000000001,9.85,"Valid",12.159999999999998,"","",4.67,5.370000000000001,9.85,12.159999999999998,9.85,12.159999999999998,4.67,5.370000000000001]
[2024,3,1,16,45352.666666666628,1.07,"Valid",5.1575000000000006,6.94,"Valid",11.845833333333333,"","",1.07,5.1575000000000006,6.94,11.845833333333333,6.94,11.845833333333333,1.07,5.1575000000000006]
[2024,3,1,17,45352.708333333292,5.92,"Valid",5.222500000000001,33.42,"Valid",12.71125,"","",5.92,5.222500000000001,33.42,12.71125,33.42,12.71125,5.92,5.222500000000001]
[2024,3,1,18,45352.749999999956,6.93,"Valid",5.2504166666666672,32.299999999999997,"Valid",13.49375,"","",6.93,5.2504166666666672,32.299999999999997,13.49375,32.299999999999997,13.49375,6.93,5.2504166666666672]
[2024,3,1,19,45352.791666666621,10.029999999999999,"Valid",5.3912500000000003,28.82,"Valid",13.685,"","",10.029999999999999,5.3912500000000003,28.82,13.685,28.82,13.685,10.029999999999999,5.3912500000000003]
[2024,3,1,20,45352.833333333285,11.1,"Valid",5.6604166666666664,20.63,"Valid",14.046666666666665,"","",11.1,5.6604166666666664,20.63,14.046666666666665,20.63,14.046666666666665,11.1,5.6604166666666664]
[2024,3,1,21,45352.874999999949,7.04,"Valid",5.7420833333333334,22.05,"Valid",14.635833333333332,"","",7.04,5.7420833333333334,22.05,14.635833333333332,22.05,14.635833333333332,7.04,5.7420833333333334]
[2024,3,1,22,45352.916666666613,7.05,"Valid",5.8204166666666666,18.84,"Valid",15.020416666666664,"","",7.05,5.8204166666666666,18.84,15.020416666666664,18.84,15.020416666666664,7.05,5.8204166666666666]
[2024,3,{"$f":"C24","v":1},23,45352.958333333278,4.96,"Valid",5.7754166666666658,11.45,"Valid",15.059999999999997,"","",4.96,5.7754166666666658,11.45,15.059999999999997,11.45,15.059999999999997,4.96,5.7754166666666658]
[2024,3,{"$f":"C2+1","v":2},0,45352.999999999942,2.75,"Valid",5.7575000000000003,7.54,"Valid",15.0725,"","",2.75,5.7575000000000003,7.54,15.0725,7.54,15.0725,2.75,5.7575000000000003]
[2024,3,{"$f":"C3+1","v":2},1,45353.041666666606,6.21,"Valid",5.9129166666666668,12.84,"Valid",15.367916666666666,"","",6.21,5.9129166666666668,12.84,15.367916666666666,12.84,15.367916666666666,6.21,5.9129166666666668]
[2024,3,2,2,45353.08333333327,2.84,"Valid",5.8512500000000003,7.3,"Valid",15.325833333333334,"","",2.84,5.8512500000000003,7.3,15.325833333333334,7.3,15.325833333333334,2.84,5.8512500000000003]
[2024,3,2,3,45353.124999999935,3.09,"Valid",5.7474999999999987,8.7899999999999991,"Valid",15.24375,"","",3.09,5.7474999999999987,8.7899999999999991,15.24375,8.7899999999999991,15.24375,3.09,5.7474999999999987]
[2024,3,2,4,45353.166666666599,6.35,"Valid",5.7616666666666658,11.95,"Valid",15.347499999999998,"","",6.35,5.7616666666666658,11.95,15.347499999999998,11.95,15.347499999999998,6.35,5.7616666666666658]
[2024,3,2,5,45353.208333333263,7.01,"Valid",5.9245833333333318,12.21,"Valid",15.604166666666664,"","",7.01,5.9245833333333318,12.21,15.604166666666664,12.21,15.604166666666664,7.01,5.9245833333333318]
[2024,3,2,6,45353.249999999927,9.82,"Valid",6.055416666666666,28.69,"Valid",15.717499999999999,"","",9.82,6.055416666666666,28.69,15.717499999999999,28.69,15.717499999999999,9.82,6.055416666666666]
[2024,3,2,7,45353.291666666591,6.2,"Valid",6.0099999999999989,17.850000000000001,"Valid",15.742916666666666,"","",6.2,6.0099999999999989,17.850000000000001,15.742916666666666,17.850000000000001,15.742916666666666,6.2,6.0099999999999989]
[2024,3,2,8,45353.333333333256,8.2100000000000009,"Valid",6.0683333333333325,16.34,"Valid",15.767083333333332,"","",8.2100000000000009,6.0683333333333325,16.34,15.767083333333332,16.34,15.767083333333332,8.2100000000000009,6.0683333333333325]
[2024,3,2,9,45353.37499999992,11.65,"Valid",6.2824999999999998,18.760000000000002,"Valid",16.043333333333333,"","",11.65,6.2824999999999998,18.760000000000002,16.043333333333333,18.760000000000002,16.043333333333333,11.65,6.2824999999999998]
[2024,3,2,10,45353.416666666584,9.4600000000000009,"Valid",6.5212500000000011,20.21,"Valid",16.419166666666666,"","",9.4600000000000009,6.5212500000000011,20.21,16.419166666666666,20.21,16.419166666666666,9.4600000000000009,6.5212500000000011]
[2024,3,2,11,45353.458333333248,5.4,"Valid",6.5433333333333339,14.59,"Valid",16.505833333333332,"","",5.4,6.5433333333333339,14.59,16.505833333333332,14.59,16.505833333333332,5.4,6.5433333333333339]
[2024,3,2,12,45353.499999999913,9.27,"Valid",6.527916666666667,18.57,"Valid",16.545416666666664,"","",9.27,6.527916666666667,18.57,16.545416666666664,18.57,16.545416666666664,9.27,6.527916666666667]
[2024,3,2,13,45353.541666666577,11.57,"Valid",6.7445833333333338,20.46,"Valid",16.980416666666663,"","",11.57,6.7445833333333338,20.46,16.980416666666663,20.46,16.980416666666663,11.57,6.7445833333333338]
[2024,3,2,14,45353.583333333241,12.42,"Valid",7.1258333333333335,21.58,"Valid",17.582499999999996,"","",12.42,7.1258333333333335,21.58,17.582499999999996,21.58,17.582499999999996,12.42,7.1258333333333335]
[2024,3,2,15,45353.624999999905,11.83,"Valid",7.4241666666666672,28.82,"Valid",18.372916666666661,"","",11.83,7.4241666666666672,28.82,18.372916666666661,28.82,18.372916666666661,11.83,7.4241666666666672]
[2024,3,2,16,45353.66666666657,"","Invalid",7.7004347826086965,"","Invalid",18.869999999999994,"Power Failure","Power outage - system reset",{"$error":"#N/A"},{"$error":"#N/A"},{"$error":"#N/A"},{"$error":"#N/A"}]
[2024,3,2,17,45353.708333333234,"","Invalid",7.7813636363636371,"","Invalid",18.208636363636359,"Power Failure","Power outage - system reset",{"$error":"#N/A"},{"$error":"#N/A"},{"$error":"#N/A"},{"$error":"#N/A"}]
[2024,3,2,18,45353.749999999898,7.16,"Valid",7.7918181818181829,13.06,"Valid",17.334090909090904,"","",7.16,7.7918181818181829,13.06,17.334090909090904,13.06,17.334090909090904,7.16,7.7918181818181829]
[2024,3,2,19,45353.791666666562,8.2100000000000009,"Valid",7.7090909090909099,14.29,"Valid",16.673636363636362,"","",8.2100000000000009,7.7090909090909099,14.29,16.673636363636362,14.29,16.673636363636362,8.2100000000000009,7.7090909090909099]
[2024,3,2,20,45353.833333333227,4.45,"Valid",7.4068181818181822,9.67,"Valid",16.175454545454546,"","",4.45,7.4068181818181822,9.67,16.175454545454546,9.67,16.175454545454546,4.45,7.4068181818181822]
[2024,3,2,21,45353.874999999891,7.6,"Valid",7.4322727272727285,12.61,"Valid",15.746363636363638,"","",7.6,7.4322727272727285,12.61,15.746363636363638,12.61,15.746363636363638,7.6,7.4322727272727285]
[2024,3,2,22,45353.916666666555,1.92,"Valid",7.1990909090909092,6.73,"Valid",15.195909090909094,"","",1.92,7.1990909090909092,6.73,15.195909090909094,6.73,15.195909090909094,1.92,7.1990909090909092]
[2024,3,2,23,45353.958333333219,4.74,"Valid",7.1890909090909085,9.4,"Valid",15.102727272727275,"","",4.74,7.1890909090909085,9.4,15.102727272727275,9.4,15.102727272727275,4.74,7.1890909090909085]
[2024,3,3,0,45353.999999999884,7.67,"Valid",7.4127272727272722,14.67,"Valid",15.426818181818184,"","",7.67,7.4127272727272722,14.67,15.426818181818184,14.67,15.426818181818184,7.67,7.4127272727272722]
[2024,3,3,1,45354.041666666548,3.67,"Valid",7.297272727272726,9.1,"Valid",15.256818181818186,"","",3.67,7.297272727272726,9.1,15.256818181818186,9.1,15.256818181818186,3.67,7.297272727272726]
[2024,3,3,2,45354.083333333212,7.18,"Valid",7.4945454545454533,11.57,"Valid",15.450909090909095,"","",7.18,7.4945454545454533,11.57,15.450909090909095,11.57,15.450909090909095,7.18,7.4945454545454533]
[2024,3,3,3,45354.124999999876,5.39,"Valid",7.5990909090909069,7.17,"Valid",15.377272727272732,"","",5.39,7.5990909090909069,7.17,15.377272727272732,7.17,15.377272727272732,5.39,7.5990909090909069]
[2024,3,3,4,45354.166666666541,3.65,"Valid",7.4763636363636357,5.4,"Valid",15.079545454545455,"","",3.65,7.4763636363636357,5.4,15.079545454545455,5.4,15.079545454545455,3.65,7.4763636363636357]
[2024,3,3,5,45354.208333333205,9.06,"Valid",7.5695454545454544,11.58,"Valid",15.050909090909091,"","",9.06,7.5695454545454544,11.58,15.050909090909091,11.58,15.050909090909091,9.06,7.5695454545454544]
[2024,3,3,6,45354.249999999869,7.05,"Valid",7.4436363636363634,9.92,"Valid",14.197727272727274,"","",7.05,7.4436363636363634,9.92,14.197727272727274,9.92,14.197727272727274,7.05,7.4436363636363634]
[2024,3,3,7,45354.291666666533,5.14,"Valid",7.3954545454545437,8.26,"Valid",13.761818181818178,"","",5.14,7.3954545454545437,8.26,13.761818181818178,8.26,13.761818181818178,5.14,7.3954545454545437]
[2024,3,3,8,45354.333333333198,9.66,"Valid",7.4613636363636351,11.07,"Valid",13.522272727272725,"","",9.66,7.4613636363636351,11.07,13.522272727272725,11.07,13.522272727272725,9.66,7.4613636363636351]
[2024,3,3,9,45354.374999999862,9.1,"Valid",7.3454545454545439,13.77,"Valid",13.29545454545454,"","",9.1,7.3454545454545439,13.77,13.29545454545454,13.77,13.29545454545454,9.1,7.3454545454545439]
[2024,3,3,10,45354.416666666526,8.31,"Valid",7.293181818181818,12.28,"Valid",12.934999999999995,"","",8.31,7.293181818181818,12.28,12.934999999999995,12.28,12.934999999999995,8.31,7.293181818181818]
[2024,3,3,11,45354.45833333319,2.91,"Valid",7.1800000000000006,8.06,"Valid",12.638181818181813,"","",2.91,7.1800000000000006,8.06,12.638181818181813,8.06,12.638181818181813,2.91,7.1800000000000006]
[2024,3,3,12,45354.499999999854,10.77,"Valid",7.2481818181818198,15.32,"Valid",12.490454545454543,"","",10.77,7.2481818181818198,15.32,12.490454545454543,15.32,12.490454545454543,10.77,7.2481818181818198]
[2024,3,3,13,45354.541666666519,9.5299999999999994,"Valid",7.1554545454545462,13.57,"Valid",12.177272727272726,"","",9.5299999999999994,7.1554545454545462,13.57,12.177272727272726,13.57,12.177272727272726,9.5299999999999994,7.1554545454545462]
[2024,3,3,14,45354.583333333183,6.21,"Valid",6.8731818181818189,10.8,"Valid",11.687272727272727,"","",6.21,6.8731818181818189,10.8,11.687272727272727,10.8,11.687272727272727,6.21,6.8731818181818189]
[2024,3,3,15,45354.624999999847,7.58,"Valid",6.6800000000000006,11.4,"Valid",10.895454545454545,"","",7.58,6.6800000000000006,11.4,10.895454545454545,11.4,10.895454545454545,7.58,6.6800000000000006]
[2024,3,3,16,45354.666666666511,8.08,"Valid",6.740869565217392,11.8,"Valid",10.934782608695652,"","",{"$f":"IF(G66=\"Valid\", F66, NA())","v":8.08},{"$f":"IF(G66=\"Valid\", H66, NA())","v":6.740869565217392},{"$f":"IF(J66=\"Valid\", I66, NA())","v":11.8},{"$f":"IF(J66=\"Valid\", K66, NA())","v":10.934782608695652},11.8,10.934782608695652,8.08,6.740869565217392]
[2024,3,3,17,45354.708333333176,3.57,"Valid",6.6087500000000006,8.6199999999999992,"Valid",10.838333333333333,"","",3.57,6.6087500000000006,8.6199999999999992,10.838333333333333,8.6199999999999992,10.838333333333333,3.57,6.6087500000000006]
[2024,3,3,{"$f":"IF(D67=23,0,D67+1)","v":18},{"$f":"E67+0.0416666666666666","v":45354.74999999984},9.31,"Valid",6.6983333333333341,14.04,"Valid",10.879166666666668,"","",9.31,6.6983333333333341,14.04,10.879166666666668,14.04,10.879166666666668,9.31,6.6983333333333341]
[2024,3,3,19,45354.791666666504,2.96,"Valid",6.4795833333333333,7.9,"Valid",10.612916666666669,"","",2.96,6.4795833333333333,7.9,10.612916666666669,7.9,10.612916666666669,2.96,6.4795833333333333]
[2024,3,3,20,45354.833333333168,6.47,"Valid",6.5637499999999998,19.79,"Valid",11.034583333333336,"","",6.47,6.5637499999999998,19.79,11.034583333333336,19.79,11.034583333333336,6.47,6.5637499999999998]
[2024,3,3,21,45354.874999999833,9.9600000000000009,"Valid",6.6620833333333325,29.05,"Valid",11.719583333333333,"","",9.9600000000000009,6.6620833333333325,29.05,11.719583333333333,29.05,11.719583333333333,9.9600000000000009,6.6620833333333325]
[2024,3,3,22,45354.916666666497,2.79,"Valid",6.6983333333333333,14.52,"Valid",12.044166666666667,"","",2.79,6.6983333333333333,14.52,12.044166666666667,14.52,12.044166666666667,2.79,6.6983333333333333]
[2024,3,3,23,45354.958333333161,5.71,"Valid",6.7387499999999996,12.26,"Valid",12.163333333333334,"","",5.71,6.7387499999999996,12.26,12.163333333333334,12.26,12.163333333333334,5.71,6.7387499999999996]
[2024,3,4,0,45354.999999999825,5.93,"Valid",6.6662499999999989,12.49,"Valid",12.0725,"","",5.93,6.6662499999999989,12.49,12.0725,12.49,12.0725,5.93,6.6662499999999989]
[2024,3,4,1,45355.04166666649,8.08,"Valid",6.8500000000000005,13.36,"Valid",12.250000000000002,"","",8.08,6.8500000000000005,13.36,12.250000000000002,13.36,12.250000000000002,8.08,6.8500000000000005]
[2024,3,4,2,45355.083333333154,4.74,"Valid",6.748333333333334,9.4700000000000006,"Valid",12.162500000000003,"","",4.74,6.748333333333334,9.4700000000000006,12.162500000000003,9.4700000000000006,12.162500000000003,4.74,6.748333333333334]
[2024,3,4,3,45355.124999999818,2.94,"Valid",6.6462500000000011,8.1300000000000008,"Valid",12.202500000000001,"","",2.94,6.6462500000000011,8.1300000000000008,12.202500000000001,8.1300000000000008,12.202500000000001,2.94,6.6462500000000011]
[2024,3,4,4,45355.166666666482,1.77,"Valid",6.567916666666668,6.16,"Valid",12.234166666666669,"","",1.77,6.567916666666668,6.16,12.234166666666669,6.16,12.234166666666669,1.77,6.567916666666668]
[2024,3,4,5,45355.208333333147,9.19,"Valid",6.5733333333333341,59.13,"Valid",14.21541666666667,"","",9.19,6.5733333333333341,59.13,14.21541666666667,59.13,14.21541666666667,9.19,6.5733333333333341]
[2024,3,4,6,45355.249999999811,11.74,"Valid",6.7687500000000016,50.05,"Valid",15.887500000000003,"","",11.74,6.7687500000000016,50.05,15.887500000000003,50.05,15.887500000000003,11.74,6.7687500000000016]
{"$rows_left_out":665}