{"text_format":"1","workbook":"xlsx","n_sheets":7,"sheets":["Instructions","Meta data_sheet","Meta data_lookup","Raw data_sheet","Raw data_format","24hr_PM10_chart","24hr_PM2.5_chart"],"not_rendered":{"charts":4,"images":0,"macros":1,"external_links":0,"defined_names":10,"comments":0,"pivot_tables":0},"unopened":[{"sheet":"24hr_PM10_chart","index":5,"reason":"not_a_worksheet"},{"sheet":"24hr_PM2.5_chart","index":6,"reason":"not_a_worksheet"}],"bounds":{"document_bytes":16777216,"sheet_cells":100000,"rows_first":2000,"rows_last":500,"rows_between":2000,"halvings":0,"cell_chars":16384,"cell_head_chars":4096},"cells_cut":0,"cells_raw":0,"read":"whole","date_system":"1900"}

{"sheet":"Instructions","index":0,"n_rows":0,"n_cols":0,"rows_kept":0,"cut":false,"hidden":false,"merged":[]}

{"sheet":"Meta data_sheet","index":1,"n_rows":17,"n_cols":5,"rows_kept":17,"cut":false,"hidden":false,"merged":[[18,0,18,1],[16,0,16,1]]}
["Ambient Monitoring Station","Details",null,"Ambient Monitoring Results","Details"]
["Location","Werris Creek",null,"PM2.5 monitoring start (dd/mm/yyyy hh:mm)","2019-06-01"]
["Easting",{"$f":"VLOOKUP($B$2,'Meta data_lookup'!$A$2:$D$5,2,FALSE)","v":276783},null,"PM2.5 monitoring end","2019-07-01"]
["Northing",{"$f":"VLOOKUP($B$2,'Meta data_lookup'!$A$2:$D$5,3,FALSE)","v":6528734},null,"PM2.5 monitoring period (h)",{"$f":"(E3-E2)*24","v":720}]
["Site elevation (m)",{"$f":"VLOOKUP($B$2,'Meta data_lookup'!$A$2:$D$5,4,FALSE)","v":"ND"},null,"Number of valid PM2.5 results",{"$f":"COUNTIF('Raw data_sheet'!G2:G745,\"Valid\")","v":530}]
["Description of surrounding land use","Agriculture/Mining",null,"Proportion of valid PM2.5 results (%)",{"$f":"E5/E4","v":0.73611111111111116}]
["Typical sources impacting on the site","Agriculture",null,"PM10 monitoring start (dd/mm/yyyy hh:mm)","2019-06-01"]
["Site compliance with AS/NZS 3580.1.1:2007","Yes",null,"PM10 monitoring end","2019-07-01"]
["PM2.5 method compliance with AS/NZS 3580.9.13:2013\n","Yes",null,"PM10 monitoring period (h)",{"$f":"(E8-E7)*24","v":720}]
["PM2.5 instrument make","Thermo Scientific",null,"Number of valid PM10 results",{"$f":"COUNTIF('Raw data_sheet'!J2:J745,\"Valid\")","v":549}]
["PM2.5 instrument model","1405DF",null,"Proportion of valid PM10 results (%)",{"$f":"E10/E9","v":0.76249999999999996}]
["PM2.5 instrument intake height (m)",3.5]
["PM10 method compliance with AS 3580.9.8-2008\n","No*"]
["PM10 instrument make","Thermo Scientific"]
["PM10 instrument model","1405DF"]
["PM10 instrument intake height (m)",3.5]
["*The 1405DF TEOM used at this site measures PM10 indirectly rather than directly. The unit does however meet the intent of AS 3580.9.8-2008, and this method has been accredited by the USEPA. It is considered scientifically robust and is used extensively throughout NSW with EPA's knowledge and informal acceptance."]

{"sheet":"Meta data_lookup","index":2,"n_rows":5,"n_cols":4,"rows_kept":5,"cut":false,"hidden":false,"merged":[]}
["Location","Easting","Northing","Site elevation (m)"]
["Maules Creek",225302,6623037,"ND"]
["Breeza",237993,6542606,"ND"]
["Will-gai",231804,6596392,"ND"]
["Werris Creek",276783,6528734,"ND"]

{"sheet":"Raw data_sheet","index":3,"n_rows":745,"n_cols":21,"rows_kept":745,"cut":false,"hidden":false,"merged":[]}
["Year","Month","Day","Hour","Date and time","PM2.5_hourly","PM2.5_Data_Status","PM2.5_24hr_rolling_average","PM10_hourly","PM10_Data_Status","PM10_24hr_rolling_average","Cause of data invalidity, if applicable","Detailed comments","PM2.5_hourly_valid_plot","PM2.5_24hr_rolling_ave_valid_plot","PM10_hourly_valid_plot","PM10_24hr_rolling_ave_valid_plot","PM10_hourly_valid_plot_series","PM10_24hr_rolling_average_valid_plot_series","PM2.5_hourly_valid_plot_series","PM2.5_24hr_rolling_average_valid_plot_series"]
[2019,6,1,0,{"$f":"DATE(A2,B2,C2)+TIME(D2,0,0)","v":43617},3.6,"Valid",0.8,19.899999999999999,"Valid",9.5,null,null,{"$f":"IF(G2=\"Valid\", F2, NA())","v":3.6},{"$f":"IF(G2=\"Valid\", H2, NA())","v":0.8},{"$f":"IF(J2=\"Valid\", I2, NA())","v":19.899999999999999},{"$f":"IF(J2=\"Valid\", K2, NA())","v":9.5},19.899999999999999,9.5,3.6,0.8]
[{"$f":"A2","v":2019},{"$f":"B2","v":6},{"$f":"C2","v":1},{"$f":"IF(D2=23,0,D2+1)","v":1},{"$f":"E2+0.0416666666666666","v":43617.041666666664},8.3000000000000007,"Valid",1.1000000000000001,37.700000000000003,"Valid",10.9,null,null,8.3000000000000007,1.1000000000000001,37.700000000000003,10.9,37.700000000000003,10.9,8.3000000000000007,1.1000000000000001]
[{"$f":"A3","v":2019},{"$f":"B3","v":6},1,{"$f":"IF(D3=23,0,D3+1)","v":2},{"$f":"E3+0.0416666666666666","v":43617.083333333328},{"$f":"NA()","v":{"$error":"#N/A"}},"Invalid",{"$f":"NA()","v":{"$error":"#N/A"}},9.6,"Valid",11.1,"Calibration Error","value outside range",{"$error":"#N/A"},{"$error":"#N/A"},9.6,11.1,9.6,11.1]
[2019,6,1,3,43617.124999999993,8.6999999999999993,"Valid",1.4,16.7,"Valid",11.7,null,null,8.6999999999999993,1.4,16.7,11.7,16.7,11.7,8.6999999999999993,1.4]
[2019,6,1,4,43617.166666666657,4.4000000000000004,"Valid",1.7,10.9,"Valid",12.1,null,null,4.4000000000000004,1.7,10.9,12.1,10.9,12.1,4.4000000000000004,1.7]
[2019,6,1,5,43617.208333333321,{"$f":"NA()","v":{"$error":"#N/A"}},"Invalid",{"$f":"NA()","v":{"$error":"#N/A"}},-0.1,"Valid",11.9,"Calibration Error","value outside range",{"$error":"#N/A"},{"$error":"#N/A"},-0.1,11.9,-0.1,11.9]
[2019,6,1,6,43617.249999999985,2.9,"Valid",1.3,12.6,"Valid",12.2,null,null,2.9,1.3,12.6,12.2,12.6,12.2,2.9,1.3]
[2019,6,1,7,43617.29166666665,0.3,"Valid",1.4,6,"Valid",12.4,null,null,0.3,1.4,6,12.4,6,12.4,0.3,1.4]
[2019,6,1,8,43617.333333333314,0.6,"Valid",1.2,4.7,"Valid",12.1,null,null,0.6,1.2,4.7,12.1,4.7,12.1,0.6,1.2]
[2019,6,1,9,43617.374999999978,{"$f":"NA()","v":{"$error":"#N/A"}},"Invalid",{"$f":"NA()","v":{"$error":"#N/A"}},-0.9,"Valid",11.9,"Calibration Error","value outside range",{"$error":"#N/A"},{"$error":"#N/A"},-0.9,11.9,-0.9,11.9]
[2019,6,1,10,43617.416666666642,4.5,"Valid",0.1,13.1,"Valid",11.6,null,null,4.5,0.1,13.1,11.6,13.1,11.6,4.5,0.1]
[2019,6,1,11,43617.458333333307,7.7,"Valid",0.3,20.399999999999999,"Valid",12.3,null,null,7.7,0.3,20.399999999999999,12.3,20.399999999999999,12.3,7.7,0.3]
[2019,6,1,12,43617.499999999971,5.0999999999999996,"Valid",0.3,13,"Valid",12.5,null,null,5.0999999999999996,0.3,13,12.5,13,12.5,5.0999999999999996,0.3]
[2019,6,1,13,43617.541666666635,3.8,"Valid",0.4,9.4,"Valid",12.3,null,null,3.8,0.4,9.4,12.3,9.4,12.3,3.8,0.4]
[2019,6,1,14,43617.583333333299,7,"Valid",0.9,13.5,"Valid",12.7,null,null,7,0.9,13.5,12.7,13.5,12.7,7,0.9]
[2019,6,1,15,43617.624999999964,7.2,"Valid",1.1000000000000001,14.2,"Valid",12.8,null,null,7.2,1.1000000000000001,14.2,12.8,14.2,12.8,7.2,1.1000000000000001]
[2019,6,1,16,43617.666666666628,4.9000000000000004,"Valid",1.2,10.4,"Valid",12.8,null,null,4.9000000000000004,1.2,10.4,12.8,10.4,12.8,4.9000000000000004,1.2]
[2019,6,1,17,43617.708333333292,10.5,"Valid",1.5,15,"Valid",12.9,null,null,10.5,1.5,15,12.9,15,12.9,10.5,1.5]
[2019,6,1,18,43617.749999999956,5.3,"Valid",1.5,8.4,"Valid",12.3,null,null,5.3,1.5,8.4,12.3,8.4,12.3,5.3,1.5]
[2019,6,1,19,43617.791666666621,1.3,"Valid",1.5,5.0999999999999996,"Valid",11.9,null,null,1.3,1.5,5.0999999999999996,11.9,5.0999999999999996,11.9,1.3,1.5]
[2019,6,1,20,43617.833333333285,-1.8,"Valid",1.3,2.8,"Valid",11.6,null,null,-1.8,1.3,2.8,11.6,2.8,11.6,-1.8,1.3]
[2019,6,1,21,43617.874999999949,{"$f":"NA()","v":{"$error":"#N/A"}},"Invalid",{"$f":"NA()","v":{"$error":"#N/A"}},-1.6,"Valid",11.2,"Calibration Error","value outside range",{"$error":"#N/A"},{"$error":"#N/A"},-1.6,11.2,-1.6,11.2]
[2019,6,1,22,43617.916666666613,{"$f":"NA()","v":{"$error":"#N/A"}},"Invalid",{"$f":"NA()","v":{"$error":"#N/A"}},-4,"Valid",9.8000000000000007,"Calibration Error","value outside range",{"$error":"#N/A"},{"$error":"#N/A"},-4,9.8000000000000007,-4,9.8000000000000007]
[2019,{"$f":"B24","v":6},{"$f":"C24","v":1},23,43617.958333333278,0.7,"Valid",1.8,3.8,"Valid",10.1,null,null,0.7,1.8,3.8,10.1,3.8,10.1,0.7,1.8]
[2019,{"$f":"B25","v":6},{"$f":"C2+1","v":2},0,43617.999999999942,6.5,"Valid",1.9,9.4,"Valid",9.6,null,null,6.5,1.9,9.4,9.6,9.4,9.6,6.5,1.9]
[2019,{"$f":"B26","v":6},{"$f":"C3+1","v":2},1,43618.041666666606,2.9,"Valid",1.7,5.3,"Valid",8.1999999999999993,null,null,2.9,1.7,5.3,8.1999999999999993,5.3,8.1999999999999993,2.9,1.7]
[2019,6,2,2,43618.08333333327,11.4,"Valid",2.4,12.5,"Valid",8.3000000000000007,null,null,11.4,2.4,12.5,8.3000000000000007,12.5,8.3000000000000007,11.4,2.4]
[2019,6,2,3,43618.124999999935,-1.6,"Valid",1.9,1.2,"Valid",7.7,null,null,-1.6,1.9,1.2,7.7,1.2,7.7,-1.6,1.9]
[2019,6,2,4,43618.166666666599,{"$f":"NA()","v":{"$error":"#N/A"}},"Invalid",{"$f":"NA()","v":{"$error":"#N/A"}},-0.8,"Valid",7.1,"Calibration Error","value outside range",{"$error":"#N/A"},{"$error":"#N/A"},-0.8,7.1,-0.8,7.1]
[2019,6,2,5,43618.208333333263,{"$f":"NA()","v":{"$error":"#N/A"}},"Invalid",{"$f":"NA()","v":{"$error":"#N/A"}},-5.8,"Valid",6.9,"Calibration Error","value outside range",{"$error":"#N/A"},{"$error":"#N/A"},-5.8,6.9,-5.8,6.9]
[2019,6,2,6,43618.249999999927,3.4,"Valid",1.5,4.9000000000000004,"Valid",6.5,null,null,3.4,1.5,4.9000000000000004,6.5,4.9000000000000004,6.5,3.4,1.5]
[2019,6,2,7,43618.291666666591,{"$f":"NA()","v":{"$error":"#N/A"}},"Invalid",{"$f":"NA()","v":{"$error":"#N/A"}},-2.2000000000000002,"Valid",6.2,"Calibration Error","value outside range",{"$error":"#N/A"},{"$error":"#N/A"},-2.2000000000000002,6.2,-2.2000000000000002,6.2]
[2019,6,2,8,43618.333333333256,-1.3,"Valid",1.2,1.5,"Valid",6.1,null,null,-1.3,1.2,1.5,6.1,1.5,6.1,-1.3,1.2]
[2019,6,2,9,43618.37499999992,-0.4,"Valid",1.9,3.2,"Valid",6.3,null,null,-0.4,1.9,3.2,6.3,3.2,6.3,-0.4,1.9]
[2019,6,2,10,43618.416666666584,1.5,"Valid",1.8,4.8,"Valid",6,null,null,1.5,1.8,4.8,6,4.8,6,1.5,1.8]
[2019,6,2,11,43618.458333333248,-1.5,"Valid",1.4,1,"Valid",5.2,null,null,-1.5,1.4,1,5.2,1,5.2,-1.5,1.4]
[2019,6,2,12,43618.499999999913,-0.1,"Valid",1.2,5.6,"Valid",4.9000000000000004,null,null,-0.1,1.2,5.6,4.9000000000000004,5.6,4.9000000000000004,-0.1,1.2]
[2019,6,2,13,43618.541666666577,3.1,"Valid",1.2,7.1,"Valid",4.8,null,null,3.1,1.2,7.1,4.8,7.1,4.8,3.1,1.2]
[2019,6,2,14,43618.583333333241,2.2999999999999998,"Valid",1,5.2,"Valid",4.5,null,null,2.2999999999999998,1,5.2,4.5,5.2,4.5,2.2999999999999998,1]
[2019,6,2,15,43618.624999999905,4.5999999999999996,"Valid",0.9,8.1999999999999993,"Valid",4.2,null,null,4.5999999999999996,0.9,8.1999999999999993,4.2,8.1999999999999993,4.2,4.5999999999999996,0.9]
[2019,6,2,16,43618.66666666657,5.7,"Valid",0.9,10.5,"Valid",4.3,null,null,5.7,0.9,10.5,4.3,10.5,4.3,5.7,0.9]
[2019,6,2,17,43618.708333333234,6.5,"Valid",0.8,14.4,"Valid",4.2,null,null,6.5,0.8,14.4,4.2,14.4,4.2,6.5,0.8]
[2019,6,2,18,43618.749999999898,10.9,"Valid",1,17.8,"Valid",4.5,null,null,10.9,1,17.8,4.5,17.8,4.5,10.9,1]
[2019,6,2,19,43618.791666666562,-0.6,"Valid",0.9,2.6,"Valid",4.4000000000000004,null,null,-0.6,0.9,2.6,4.4000000000000004,2.6,4.4000000000000004,-0.6,0.9]
[2019,6,2,20,43618.833333333227,1.4,"Valid",1,3.8,"Valid",4.5,null,null,1.4,1,3.8,4.5,3.8,4.5,1.4,1]
[2019,6,2,21,43618.874999999891,{"$f":"NA()","v":{"$error":"#N/A"}},"Invalid",{"$f":"NA()","v":{"$error":"#N/A"}},-1.1000000000000001,"Valid",4.5,"Calibration Error","value outside range",{"$error":"#N/A"},{"$error":"#N/A"},-1.1000000000000001,4.5,-1.1000000000000001,4.5]
[2019,6,2,22,43618.916666666555,3.6,"Valid",1.6,5.0999999999999996,"Valid",4.9000000000000004,null,null,3.6,1.6,5.0999999999999996,4.9000000000000004,5.0999999999999996,4.9000000000000004,3.6,1.6]
[2019,6,2,23,43618.958333333219,-1.3,"Valid",1.5,1.1000000000000001,"Valid",4.8,null,null,-1.3,1.5,1.1000000000000001,4.8,1.1000000000000001,4.8,-1.3,1.5]
[2019,6,3,0,43618.999999999884,1,"Valid",1.3,3.6,"Valid",4.5,null,null,1,1.3,3.6,4.5,3.6,4.5,1,1.3]
[2019,6,3,1,43619.041666666548,-2,"Valid",1.1000000000000001,0.2,"Valid",4.3,null,null,-2,1.1000000000000001,0.2,4.3,0.2,4.3,-2,1.1000000000000001]
[2019,6,3,2,43619.083333333212,{"$f":"NA()","v":{"$error":"#N/A"}},"Invalid",{"$f":"NA()","v":{"$error":"#N/A"}},-2.6,"Valid",3.7,"Calibration Error","value outside range",{"$error":"#N/A"},{"$error":"#N/A"},-2.6,3.7,-2.6,3.7]
[2019,6,3,3,43619.124999999876,{"$f":"NA()","v":{"$error":"#N/A"}},"Invalid",{"$f":"NA()","v":{"$error":"#N/A"}},-0.9,"Valid",3.6,"Calibration Error","value outside range",{"$error":"#N/A"},{"$error":"#N/A"},-0.9,3.6,-0.9,3.6]
[2019,6,3,4,43619.166666666541,6.2,"Valid",0.7,7.4,"Valid",3.9,null,null,6.2,0.7,7.4,3.9,7.4,3.9,6.2,0.7]
[2019,6,3,5,43619.208333333205,{"$f":"NA()","v":{"$error":"#N/A"}},"Invalid",{"$f":"NA()","v":{"$error":"#N/A"}},0.2,"Valid",4.2,"Calibration Error","value outside range",{"$error":"#N/A"},{"$error":"#N/A"},0.2,4.2,0.2,4.2]
[2019,6,3,6,43619.249999999869,1,"Valid",0.9,3.9,"Valid",4.2,null,null,1,0.9,3.9,4.2,3.9,4.2,1,0.9]
[2019,6,3,7,43619.291666666533,7.1,"Valid",1.3,9.1999999999999993,"Valid",4.5999999999999996,null,null,7.1,1.3,9.1999999999999993,4.5999999999999996,9.1999999999999993,4.5999999999999996,7.1,1.3]
[2019,6,3,8,43619.333333333198,1,"Valid",1.4,4.0999999999999996,"Valid",4.7,null,null,1,1.4,4.0999999999999996,4.7,4.0999999999999996,4.7,1,1.4]
[2019,6,3,9,43619.374999999862,2.1,"Valid",1.5,5.7,"Valid",4.8,null,null,2.1,1.5,5.7,4.8,5.7,4.8,2.1,1.5]
[2019,6,3,10,43619.416666666526,3.9,"Valid",1.6,7.1,"Valid",5,null,null,3.9,1.6,7.1,5,7.1,5,3.9,1.6]
[2019,6,3,11,43619.45833333319,6.8,"Valid",2,9.5,"Valid",5.3,null,null,6.8,2,9.5,5.3,9.5,5.3,6.8,2]
[2019,6,3,12,43619.499999999854,5.5,"Valid",2.2000000000000002,8.4,"Valid",5.5,null,null,5.5,2.2000000000000002,8.4,5.5,8.4,5.5,5.5,2.2000000000000002]
[2019,6,3,13,43619.541666666519,-1.9,"Valid",2,2.1,"Valid",5.3,null,null,-1.9,2,2.1,5.3,2.1,5.3,-1.9,2]
[2019,6,3,14,43619.583333333183,7.2,"Valid",2.2000000000000002,11.7,"Valid",5.5,null,null,7.2,2.2000000000000002,11.7,5.5,11.7,5.5,7.2,2.2000000000000002]
[2019,6,3,15,43619.624999999847,0.8,"Valid",2.1,3.9,"Valid",5.3,null,null,0.8,2.1,3.9,5.3,3.9,5.3,0.8,2.1]
[2019,6,3,16,43619.666666666511,1.5,"Valid",1.9,4.5999999999999996,"Valid",5.0999999999999996,null,null,{"$f":"IF(G66=\"Valid\", F66, NA())","v":1.5},{"$f":"IF(G66=\"Valid\", H66, NA())","v":1.9},{"$f":"IF(J66=\"Valid\", I66, NA())","v":4.5999999999999996},{"$f":"IF(J66=\"Valid\", K66, NA())","v":5.0999999999999996},4.5999999999999996,5.0999999999999996,1.5,1.9]
[2019,6,3,17,43619.708333333176,{"$f":"NA()","v":{"$error":"#N/A"}},"Invalid",{"$f":"NA()","v":{"$error":"#N/A"}},-1.9,"Valid",4.4000000000000004,"Calibration Error","value outside range",{"$error":"#N/A"},{"$error":"#N/A"},-1.9,4.4000000000000004,-1.9,4.4000000000000004]
[{"$f":"A67","v":2019},6,3,{"$f":"IF(D67=23,0,D67+1)","v":18},{"$f":"E67+0.0416666666666666","v":43619.74999999984},{"$f":"NA()","v":{"$error":"#N/A"}},"Invalid",{"$f":"NA()","v":{"$error":"#N/A"}},-0.6,"Valid",3.6,"Calibration Error","value outside range",{"$error":"#N/A"},{"$error":"#N/A"},-0.6,3.6,-0.6,3.6]
[2019,6,3,19,43619.791666666504,6.1,"Valid",1,8.1,"Valid",3.8,null,null,6.1,1,8.1,3.8,8.1,3.8,6.1,1]
[2019,6,3,20,43619.833333333168,5.3,"Valid",1.2,7.6,"Valid",4,null,null,5.3,1.2,7.6,4,7.6,4,5.3,1.2]
[2019,6,3,21,43619.874999999833,4.0999999999999996,"Valid",1.5,5.8,"Valid",4.3,null,null,4.0999999999999996,1.5,5.8,4.3,5.8,4.3,4.0999999999999996,1.5]
[2019,6,3,22,43619.916666666497,3.9,"Valid",1.5,4.0999999999999996,"Valid",4.2,null,null,3.9,1.5,4.0999999999999996,4.2,4.0999999999999996,4.2,3.9,1.5]
[2019,6,3,23,43619.958333333161,1.5,"Valid",1.6,1.1000000000000001,"Valid",4.2,null,null,1.5,1.6,1.1000000000000001,4.2,1.1000000000000001,4.2,1.5,1.6]
[2019,6,4,0,43619.999999999825,{"$f":"NA()","v":{"$error":"#N/A"}},"Invalid",{"$f":"NA()","v":{"$error":"#N/A"}},13.7,"Valid",4.5999999999999996,"Calibration Error","PM2.5 > PM10",{"$error":"#N/A"},{"$error":"#N/A"},13.7,4.5999999999999996,13.7,4.5999999999999996]
[2019,6,4,1,43620.04166666649,{"$f":"NA()","v":{"$error":"#N/A"}},"Invalid",{"$f":"NA()","v":{"$error":"#N/A"}},-4.8,"Valid",4.4000000000000004,"Calibration Error","value outside range",{"$error":"#N/A"},{"$error":"#N/A"},-4.8,4.4000000000000004,-4.8,4.4000000000000004]
[2019,6,4,2,43620.083333333154,{"$f":"NA()","v":{"$error":"#N/A"}},"Invalid",{"$f":"NA()","v":{"$error":"#N/A"}},-2.8,"Valid",4.4000000000000004,"Calibration Error","value outside range",{"$error":"#N/A"},{"$error":"#N/A"},-2.8,4.4000000000000004,-2.8,4.4000000000000004]
[2019,6,4,3,43620.124999999818,0,"Valid",2.2000000000000002,2.1,"Valid",4.5,null,null,0,2.2000000000000002,2.1,4.5,2.1,4.5,0,2.2000000000000002]
[2019,6,4,4,43620.166666666482,3.1,"Valid",2,4.4000000000000004,"Valid",4.4000000000000004,null,null,3.1,2,4.4000000000000004,4.4000000000000004,4.4000000000000004,4.4000000000000004,3.1,2]
[2019,6,4,5,43620.208333333147,1.5,"Valid",2.2000000000000002,3.1,"Valid",4.5,null,null,1.5,2.2000000000000002,3.1,4.5,3.1,4.5,1.5,2.2000000000000002]
[2019,6,4,6,43620.249999999811,6.6,"Valid",2.5,7.6,"Valid",4.7,null,null,6.6,2.5,7.6,4.7,7.6,4.7,6.6,2.5]
[2019,6,4,7,43620.291666666475,11.7,"Valid",2.7,12.1,"Valid",4.8,null,null,11.7,2.7,12.1,4.8,12.1,4.8,11.7,2.7]
[2019,6,4,8,43620.333333333139,5.0999999999999996,"Valid",2.8,6.5,"Valid",4.9000000000000004,null,null,5.0999999999999996,2.8,6.5,4.9000000000000004,6.5,4.9000000000000004,5.0999999999999996,2.8]
[2019,6,4,9,43620.374999999804,14.7,"Valid",3.4,15.3,"Valid",5.3,null,null,14.7,3.4,15.3,5.3,15.3,5.3,14.7,3.4]
[2019,6,4,10,43620.416666666468,7.2,"Valid",3.5,9.1,"Valid",5.5,null,null,7.2,3.5,9.1,5.5,9.1,5.5,7.2,3.5]
[2019,6,4,11,43620.458333333132,22,"Valid",4.2,24.1,"Valid",6.1,null,null,22,4.2,24.1,6.1,24.1,6.1,22,4.2]
[2019,6,4,12,43620.499999999796,9,"Valid",4.4000000000000004,11.2,"Valid",6.3,null,null,9,4.4000000000000004,11.2,6.3,11.2,6.3,9,4.4000000000000004]
[2019,6,4,13,43620.541666666461,8.4,"Valid",4.8,11.4,"Valid",6.6,null,null,8.4,4.8,11.4,6.6,11.4,6.6,8.4,4.8]
[2019,6,4,14,43620.583333333125,15.6,"Valid",5.2,18.5,"Valid",7,null,null,15.6,5.2,18.5,7,18.5,7,15.6,5.2]
[2019,6,4,15,43620.624999999789,2.2000000000000002,"Valid",5.2,10,"Valid",7.2,null,null,2.2000000000000002,5.2,10,7.2,10,7.2,2.2000000000000002,5.2]
[2019,6,4,16,43620.666666666453,3.8,"Valid",5.3,11.4,"Valid",7.5,null,null,3.8,5.3,11.4,7.5,11.4,7.5,3.8,5.3]
[2019,{"$f":"B90","v":6},{"$f":"C67+1","v":4},17,43620.708333333117,9.4,"Valid",5.9,20.100000000000001,"Valid",8.4,null,null,9.4,5.9,20.100000000000001,8.4,20.100000000000001,8.4,9.4,5.9]
[2019,6,4,18,43620.749999999782,7.2,"Valid",6.4,12.1,"Valid",8.9,null,null,7.2,6.4,12.1,8.9,12.1,8.9,7.2,6.4]
[2019,6,4,19,43620.791666666446,8.4,"Valid",6.4,12.3,"Valid",9,null,null,8.4,6.4,12.3,9,12.3,9,8.4,6.4]
[2019,6,4,20,43620.83333333311,9.6999999999999993,"Valid",6.6,13.7,"Valid",9.3000000000000007,null,null,9.6999999999999993,6.6,13.7,9.3000000000000007,13.7,9.3000000000000007,9.6999999999999993,6.6]
[2019,6,4,21,43620.874999999774,9.6999999999999993,"Valid",6.8,14.7,"Valid",9.6,null,null,9.6999999999999993,6.8,14.7,9.6,14.7,9.6,9.6999999999999993,6.8]
[2019,6,4,22,43620.916666666439,12.9,"Valid",7.2,23,"Valid",10.4,null,null,12.9,7.2,23,10.4,23,10.4,12.9,7.2]
[2019,6,4,23,43620.958333333103,12.2,"Valid",7.6,18.100000000000001,"Valid",11,null,null,12.2,7.6,18.100000000000001,11,18.100000000000001,11,12.2,7.6]
[2019,6,5,0,43620.999999999767,12.1,"Valid",7.5,16.7,"Valid",11.2,null,null,12.1,7.5,16.7,11.2,16.7,11.2,12.1,7.5]
[2019,6,5,1,43621.041666666431,8.3000000000000007,"Valid",8.1,11.2,"Valid",11.8,null,null,8.3000000000000007,8.1,11.2,11.8,11.2,11.8,8.3000000000000007,8.1]
[2019,6,5,2,43621.083333333096,11.6,"Valid",8.8000000000000007,14.1,"Valid",12.5,null,null,11.6,8.8000000000000007,14.1,12.5,14.1,12.5,11.6,8.8000000000000007]
[2019,6,5,3,43621.12499999976,13.7,"Valid",9.4,16.2,"Valid",13.1,null,null,13.7,9.4,16.2,13.1,16.2,13.1,13.7,9.4]
[2019,6,5,4,43621.166666666424,13.8,"Valid",9.8000000000000007,18.5,"Valid",13.7,null,null,13.8,9.8000000000000007,18.5,13.7,18.5,13.7,13.8,9.8000000000000007]
[2019,6,5,5,43621.208333333088,12,"Valid",10.3,16.399999999999999,"Valid",14.3,null,null,12,10.3,16.399999999999999,14.3,16.399999999999999,14.3,12,10.3]
[2019,6,5,6,43621.249999999753,6.9,"Valid",10.199999999999999,10.4,"Valid",14.3,null,null,6.9,10.199999999999999,10.4,14.3,10.4,14.3,6.9,10.199999999999999]
[2019,6,5,7,43621.291666666417,11.1,"Valid",10.199999999999999,13.9,"Valid",14.4,null,null,11.1,10.199999999999999,13.9,14.4,13.9,14.4,11.1,10.199999999999999]
[2019,6,5,8,43621.333333333081,11.1,"Valid",10.5,15.5,"Valid",14.8,null,null,11.1,10.5,15.5,14.8,15.5,14.8,11.1,10.5]
[2019,6,5,9,43621.374999999745,12.8,"Valid",10.5,19.399999999999999,"Valid",15,null,null,12.8,10.5,19.399999999999999,15,19.399999999999999,15,12.8,10.5]
[2019,6,5,10,43621.41666666641,9.5,"Valid",10.6,15.9,"Valid",15.4,null,null,9.5,10.6,15.9,15.4,15.9,15.4,9.5,10.6]
[2019,6,5,11,43621.458333333074,10.7,"Valid",10.1,17.5,"Valid",15.1,null,null,10.7,10.1,17.5,15.1,17.5,15.1,10.7,10.1]
[2019,6,5,12,43621.499999999738,12.9,"Valid",10.4,18.3,"Valid",15.5,null,null,12.9,10.4,18.3,15.5,18.3,15.5,12.9,10.4]
[2019,6,5,13,43621.541666666402,12.6,"Valid",10.5,18.7,"Valid",15.8,null,null,12.6,10.5,18.7,15.8,18.7,15.8,12.6,10.5]
[2019,6,5,14,43621.583333333067,15.5,"Valid",10.5,19.8,"Valid",15.9,null,null,15.5,10.5,19.8,15.9,19.8,15.9,15.5,10.5]
[2019,6,5,15,43621.624999999731,12.9,"Valid",11,17.899999999999999,"Valid",16.2,null,null,12.9,11,17.899999999999999,16.2,17.899999999999999,16.2,12.9,11]
[2019,6,5,16,43621.666666666395,4.9000000000000004,"Valid",11,12.9,"Valid",16.2,null,null,4.9000000000000004,11,12.9,16.2,12.9,16.2,4.9000000000000004,11]
[2019,6,5,17,43621.708333333059,5.3,"Valid",10.7,11.1,"Valid",15.7,null,null,5.3,10.7,11.1,15.7,11.1,15.7,5.3,10.7]
[2019,6,5,18,43621.749999999724,5,"Valid",10.6,9.9,"Valid",15.6,null,null,5,10.6,9.9,15.6,9.9,15.6,5,10.6]
[2019,6,5,19,43621.791666666388,5.8,"Valid",10.5,11.2,"Valid",15.5,null,null,5.8,10.5,11.2,15.5,11.2,15.5,5.8,10.5]
[2019,6,5,20,43621.833333333052,8.5,"Valid",10.4,13,"Valid",15.5,null,null,8.5,10.4,13,15.5,13,15.5,8.5,10.4]
[2019,6,5,21,43621.874999999716,13.3,"Valid",10.5,17.399999999999999,"Valid",15.5,null,null,13.3,10.5,17.399999999999999,15.5,17.399999999999999,15.5,13.3,10.5]
[2019,6,5,22,43621.91666666638,13,"Valid",10.5,16.399999999999999,"Valid",15.1,null,null,13,10.5,16.399999999999999,15.1,16.399999999999999,15.1,13,10.5]
{"$rows_left_out":626}
{"sheet":"Raw data_format","index":4,"n_rows":8,"n_cols":6,"rows_kept":8,"cut":false,"hidden":false,"merged":[]}
["Parameter","Format","Comment","Units of measure","Minimum","Maximum"]
["Year","yyyy","4 integer format","Not applicable",2015,"Until reporting ceases"]
["Month","mm","2 integer format","Not applicable",1,12]
["Day","dd","2 integer format","Not applicable",1,31]
["Hour","hh","2 integer format","Not applicable",0,23]
["PM10",0,"1 decimal place resolution","µg/m3","Negative","Instrument specific"]
["PM2.5",0,"2 decimal place resolution","µg/m3","Negative","Instrument specific"]
["Status","Text","7 character format","Not applicable","Valid","Invalid"]