{"text_format":"1","workbook":"xlsx","n_sheets":7,"sheets":["Instructions","Meta data_sheet","Meta data_lookup","Raw data_sheet","Raw data_format","24hr_PM10_chart","24hr_PM2.5_chart"],"not_rendered":{"charts":4,"images":0,"macros":1,"external_links":0,"defined_names":10,"comments":0,"pivot_tables":0},"unopened":[{"sheet":"24hr_PM10_chart","index":5,"reason":"not_a_worksheet"},{"sheet":"24hr_PM2.5_chart","index":6,"reason":"not_a_worksheet"}],"bounds":{"document_bytes":16777216,"sheet_cells":100000,"rows_first":2000,"rows_last":500,"rows_between":2000,"halvings":0,"cell_chars":16384,"cell_head_chars":4096},"cells_cut":0,"cells_raw":0,"read":"whole","date_system":"1900"}

{"sheet":"Instructions","index":0,"n_rows":0,"n_cols":0,"rows_kept":0,"cut":false,"hidden":false,"merged":[]}

{"sheet":"Meta data_sheet","index":1,"n_rows":17,"n_cols":5,"rows_kept":17,"cut":false,"hidden":false,"merged":[[18,0,18,1],[16,0,16,1]]}
["Ambient Monitoring Station","Details",null,"Ambient Monitoring Results","Details"]
["Location","Werris Creek",null,"PM2.5 monitoring start (dd/mm/yyyy hh:mm)","2020-04-01"]
["Easting",{"$f":"VLOOKUP($B$2,'Meta data_lookup'!$A$2:$D$5,2,FALSE)","v":276783},null,"PM2.5 monitoring end","2020-05-01"]
["Northing",{"$f":"VLOOKUP($B$2,'Meta data_lookup'!$A$2:$D$5,3,FALSE)","v":6528734},null,"PM2.5 monitoring period (h)",{"$f":"(E3-E2)*24","v":720}]
["Site elevation (m)",{"$f":"VLOOKUP($B$2,'Meta data_lookup'!$A$2:$D$5,4,FALSE)","v":"ND"},null,"Number of valid PM2.5 results",{"$f":"COUNTIF('Raw data_sheet'!G2:G745,\"Valid\")","v":563}]
["Description of surrounding land use","Agriculture/Mining",null,"Proportion of valid PM2.5 results (%)",{"$f":"E5/E4","v":0.78194444444444444}]
["Typical sources impacting on the site","Agriculture",null,"PM10 monitoring start (dd/mm/yyyy hh:mm)","2020-04-01"]
["Site compliance with AS/NZS 3580.1.1:2007","Yes",null,"PM10 monitoring end","2020-05-01"]
["PM2.5 method compliance with AS/NZS 3580.9.13:2013\n","Yes",null,"PM10 monitoring period (h)",{"$f":"(E8-E7)*24","v":720}]
["PM2.5 instrument make","Thermo Scientific",null,"Number of valid PM10 results",{"$f":"COUNTIF('Raw data_sheet'!J2:J745,\"Valid\")","v":563}]
["PM2.5 instrument model","1405DF",null,"Proportion of valid PM10 results (%)",{"$f":"E10/E9","v":0.78194444444444444}]
["PM2.5 instrument intake height (m)",3.5]
["PM10 method compliance with AS 3580.9.8-2008\n","No*"]
["PM10 instrument make","Thermo Scientific"]
["PM10 instrument model","1405DF"]
["PM10 instrument intake height (m)",3.5]
["*The 1405DF TEOM used at this site measures PM10 indirectly rather than directly. The unit does however meet the intent of AS 3580.9.8-2008, and this method has been accredited by the USEPA. It is considered scientifically robust and is used extensively throughout NSW with EPA's knowledge and informal acceptance."]

{"sheet":"Meta data_lookup","index":2,"n_rows":5,"n_cols":4,"rows_kept":5,"cut":false,"hidden":false,"merged":[]}
["Location","Easting","Northing","Site elevation (m)"]
["Maules Creek",225302,6623037,"ND"]
["Breeza",237993,6542606,"ND"]
["Will-gai",231804,6596392,"ND"]
["Werris Creek",276783,6528734,"ND"]

{"sheet":"Raw data_sheet","index":3,"n_rows":745,"n_cols":21,"rows_kept":745,"cut":false,"hidden":false,"merged":[]}
["Year","Month","Day","Hour","Date and time","PM2.5_hourly","PM2.5_Data_Status","PM2.5_24hr_rolling_average","PM10_hourly","PM10_Data_Status","PM10_24hr_rolling_average","Cause of data invalidity, if applicable","Detailed comments","PM2.5_hourly_valid_plot","PM2.5_24hr_rolling_ave_valid_plot","PM10_hourly_valid_plot","PM10_24hr_rolling_ave_valid_plot","PM10_hourly_valid_plot_series","PM10_24hr_rolling_average_valid_plot_series","PM2.5_hourly_valid_plot_series","PM2.5_24hr_rolling_average_valid_plot_series"]
[2020,4,1,0,{"$f":"DATE(A2,B2,C2)+TIME(D2,0,0)","v":43922},10.1,"Valid",7.5,11.3,"Valid",9,null,null,{"$f":"IF(G2=\"Valid\", F2, NA())","v":10.1},{"$f":"IF(G2=\"Valid\", H2, NA())","v":7.5},{"$f":"IF(J2=\"Valid\", I2, NA())","v":11.3},{"$f":"IF(J2=\"Valid\", K2, NA())","v":9},11.3,9,10.1,7.5]
[{"$f":"A2","v":2020},{"$f":"B2","v":4},{"$f":"C2","v":1},{"$f":"IF(D2=23,0,D2+1)","v":1},{"$f":"E2+0.0416666666666666","v":43922.041666666664},18.8,"Valid",7.9,30.6,"Valid",9.9,null,null,18.8,7.9,30.6,9.9,30.6,9.9,18.8,7.9]
[{"$f":"A3","v":2020},{"$f":"B3","v":4},1,{"$f":"IF(D3=23,0,D3+1)","v":2},{"$f":"E3+0.0416666666666666","v":43922.083333333328},20.7,"Valid",8.3000000000000007,59.4,"Valid",12,null,null,20.7,8.3000000000000007,59.4,12,59.4,12,20.7,8.3000000000000007]
[2020,4,1,3,43922.124999999993,13.3,"Valid",8.6,29.8,"Valid",13,null,null,13.3,8.6,29.8,13,29.8,13,13.3,8.6]
[2020,4,1,4,43922.166666666657,20.6,"Valid",9.4,28,"Valid",14.1,null,null,20.6,9.4,28,14.1,28,14.1,20.6,9.4]
[2020,4,1,5,43922.208333333321,29.9,"Valid",10.6,55.9,"Valid",16.399999999999999,null,null,29.9,10.6,55.9,16.399999999999999,55.9,16.399999999999999,29.9,10.6]
[2020,4,1,6,43922.249999999985,21,"Valid",11.4,56.9,"Valid",18.8,null,null,21,11.4,56.9,18.8,56.9,18.8,21,11.4]
[2020,4,1,7,43922.29166666665,30.9,"Valid",11.9,43.9,"Valid",19.899999999999999,null,null,30.9,11.9,43.9,19.899999999999999,43.9,19.899999999999999,30.9,11.9]
[2020,4,1,8,43922.333333333314,19.8,"Valid",12.4,30.4,"Valid",20.8,null,null,19.8,12.4,30.4,20.8,30.4,20.8,19.8,12.4]
[2020,4,1,9,43922.374999999978,19.5,"Valid",13,22.9,"Valid",21.5,null,null,19.5,13,22.9,21.5,22.9,21.5,19.5,13]
[2020,4,1,10,43922.416666666642,14.7,"Valid",13.3,17.8,"Valid",22,null,null,14.7,13.3,17.8,22,17.8,22,14.7,13.3]
[2020,4,1,11,43922.458333333307,18.100000000000001,"Valid",13.9,19.8,"Valid",22.7,null,null,18.100000000000001,13.9,19.8,22.7,19.8,22.7,18.100000000000001,13.9]
[2020,4,1,12,43922.499999999971,11.1,"Valid",13.8,12.5,"Valid",22.2,null,null,11.1,13.8,12.5,22.2,12.5,22.2,11.1,13.8]
[2020,4,1,13,43922.541666666635,10.8,"Valid",13.6,12.4,"Valid",21.8,null,null,10.8,13.6,12.4,21.8,12.4,21.8,10.8,13.6]
[2020,4,1,14,43922.583333333299,21.3,"Valid",15.5,22.6,"Valid",24.3,null,null,21.3,15.5,22.6,24.3,22.6,24.3,21.3,15.5]
[2020,4,1,15,43922.624999999964,19.3,"Valid",16,21.4,"Valid",24.8,null,null,19.3,16,21.4,24.8,21.4,24.8,19.3,16]
[2020,4,1,16,43922.666666666628,25.7,"Valid",16.600000000000001,27.6,"Valid",25.3,null,null,25.7,16.600000000000001,27.6,25.3,27.6,25.3,25.7,16.600000000000001]
[2020,4,1,17,43922.708333333292,4.3,"Valid",15.9,5.5,"Valid",24.6,null,null,4.3,15.9,5.5,24.6,5.5,24.6,4.3,15.9]
[2020,4,1,18,43922.749999999956,4.7,"Valid",15.2,6,"Valid",23.9,null,null,4.7,15.2,6,23.9,6,23.9,4.7,15.2]
[2020,4,1,19,43922.791666666621,13.5,"Valid",15.5,17.100000000000001,"Valid",23.8,null,null,13.5,15.5,17.100000000000001,23.8,17.100000000000001,23.8,13.5,15.5]
[2020,4,1,20,43922.833333333285,11.9,"Valid",15.7,13.8,"Valid",23.7,null,null,11.9,15.7,13.8,23.7,13.8,23.7,11.9,15.7]
[2020,4,1,21,43922.874999999949,16.899999999999999,"Valid",15.9,20.399999999999999,"Valid",24,null,null,16.899999999999999,15.9,20.399999999999999,24,20.399999999999999,24,16.899999999999999,15.9]
[2020,4,1,22,43922.916666666613,12.1,"Valid",16.3,13.9,"Valid",24.4,null,null,12.1,16.3,13.9,24.4,13.9,24.4,12.1,16.3]
[2020,{"$f":"B24","v":4},{"$f":"C24","v":1},23,43922.958333333278,19.7,"Valid",17,20.399999999999999,"Valid",25.1,null,null,19.7,17,20.399999999999999,25.1,20.399999999999999,25.1,19.7,17]
[2020,{"$f":"B25","v":4},{"$f":"C2+1","v":2},0,43922.999999999942,13.1,"Valid",17.2,15,"Valid",25.3,null,null,13.1,17.2,15,25.3,15,25.3,13.1,17.2]
[2020,{"$f":"B26","v":4},{"$f":"C3+1","v":2},1,43923.041666666606,12.5,"Valid",16.899999999999999,14.1,"Valid",24.6,null,null,12.5,16.899999999999999,14.1,24.6,14.1,24.6,12.5,16.899999999999999]
[2020,4,2,2,43923.08333333327,18.7,"Valid",16.8,20.399999999999999,"Valid",22.9,null,null,18.7,16.8,20.399999999999999,22.9,20.399999999999999,22.9,18.7,16.8]
[2020,4,2,3,43923.124999999935,14.6,"Valid",16.8,15.5,"Valid",22.3,null,null,14.6,16.8,15.5,22.3,15.5,22.3,14.6,16.8]
[2020,4,2,4,43923.166666666599,18.600000000000001,"Valid",16.7,18.899999999999999,"Valid",21.8,null,null,18.600000000000001,16.7,18.899999999999999,21.8,18.899999999999999,21.8,18.600000000000001,16.7]
[2020,4,2,5,43923.208333333263,19.7,"Valid",16.3,20.3,"Valid",20.3,null,null,19.7,16.3,20.3,20.3,20.3,20.3,19.7,16.3]
[2020,4,2,6,43923.249999999927,15.8,"Valid",16,15.9,"Valid",18.5,null,null,15.8,16,15.9,18.5,15.9,18.5,15.8,16]
[2020,4,2,7,43923.291666666591,19.5,"Valid",15.5,19.5,"Valid",17.5,null,null,19.5,15.5,19.5,17.5,19.5,17.5,19.5,15.5]
[2020,4,2,8,43923.333333333256,18,"Valid",15.5,20,"Valid",17.100000000000001,null,null,18,15.5,20,17.100000000000001,20,17.100000000000001,18,15.5]
[2020,4,2,9,43923.37499999992,20.6,"Valid",15.6,22.3,"Valid",17.2,null,null,20.6,15.6,22.3,17.2,22.3,17.2,20.6,15.6]
[2020,4,2,10,43923.416666666584,8.1,"Valid",15.4,13.3,"Valid",17.100000000000001,null,null,8.1,15.4,13.3,17.100000000000001,13.3,17.100000000000001,8.1,15.4]
[2020,4,2,11,43923.458333333248,18.100000000000001,"Valid",15.5,20.3,"Valid",17.100000000000001,null,null,18.100000000000001,15.5,20.3,17.100000000000001,20.3,17.100000000000001,18.100000000000001,15.5]
[2020,4,2,12,43923.499999999913,16.8,"Valid",15.8,19.2,"Valid",17.5,null,null,16.8,15.8,19.2,17.5,19.2,17.5,16.8,15.8]
[2020,4,2,13,43923.541666666577,6,"Valid",15.5,9.6,"Valid",17.3,null,null,6,15.5,9.6,17.3,9.6,17.3,6,15.5]
[2020,4,2,14,43923.583333333241,9.1999999999999993,"Valid",15,14.2,"Valid",17,null,null,9.1999999999999993,15,14.2,17,14.2,17,9.1999999999999993,15]
[2020,4,2,15,43923.624999999905,11.7,"Valid",14.6,20.7,"Valid",16.8,null,null,11.7,14.6,20.7,16.8,20.7,16.8,11.7,14.6]
[2020,4,2,16,43923.66666666657,18.8,"Valid",14.3,21.5,"Valid",16.600000000000001,null,null,18.8,14.3,21.5,16.600000000000001,21.5,16.600000000000001,18.8,14.3]
[2020,4,2,17,43923.708333333234,17.100000000000001,"Valid",14.8,18,"Valid",17,null,null,17.100000000000001,14.8,18,17,18,17,17.100000000000001,14.8]
[2020,4,2,18,43923.749999999898,{"$f":"NA()","v":{"$error":"#N/A"}},"Invalid",{"$f":"-NA()","v":{"$error":"#N/A"}},{"$f":"NA()","v":{"$error":"#N/A"}},"Invalid",{"$f":"NA()","v":{"$error":"#N/A"}},"Calibration Error","value outside range",{"$error":"#N/A"},{"$error":"#N/A"},{"$error":"#N/A"},{"$error":"#N/A"}]
[2020,4,2,19,43923.791666666562,{"$f":"NA()","v":{"$error":"#N/A"}},"Invalid",{"$f":"-NA()","v":{"$error":"#N/A"}},{"$f":"NA()","v":{"$error":"#N/A"}},"Invalid",{"$f":"NA()","v":{"$error":"#N/A"}},"Calibration Error","value outside range",{"$error":"#N/A"},{"$error":"#N/A"},{"$error":"#N/A"},{"$error":"#N/A"}]
[2020,4,2,20,43923.833333333227,{"$f":"NA()","v":{"$error":"#N/A"}},"Invalid",{"$f":"-NA()","v":{"$error":"#N/A"}},{"$f":"NA()","v":{"$error":"#N/A"}},"Invalid",{"$f":"NA()","v":{"$error":"#N/A"}},"Calibration Error","value outside range",{"$error":"#N/A"},{"$error":"#N/A"},{"$error":"#N/A"},{"$error":"#N/A"}]
[2020,4,2,21,43923.874999999891,{"$f":"NA()","v":{"$error":"#N/A"}},"Invalid",{"$f":"-NA()","v":{"$error":"#N/A"}},{"$f":"NA()","v":{"$error":"#N/A"}},"Invalid",{"$f":"NA()","v":{"$error":"#N/A"}},"Calibration Error","value outside range",{"$error":"#N/A"},{"$error":"#N/A"},{"$error":"#N/A"},{"$error":"#N/A"}]
[2020,4,2,22,43923.916666666555,{"$f":"NA()","v":{"$error":"#N/A"}},"Invalid",{"$f":"-NA()","v":{"$error":"#N/A"}},{"$f":"NA()","v":{"$error":"#N/A"}},"Invalid",{"$f":"NA()","v":{"$error":"#N/A"}},"Calibration Error","value outside range",{"$error":"#N/A"},{"$error":"#N/A"},{"$error":"#N/A"},{"$error":"#N/A"}]
[2020,4,2,23,43923.958333333219,{"$f":"NA()","v":{"$error":"#N/A"}},"Invalid",{"$f":"-NA()","v":{"$error":"#N/A"}},{"$f":"NA()","v":{"$error":"#N/A"}},"Invalid",{"$f":"NA()","v":{"$error":"#N/A"}},"Calibration Error","value outside range",{"$error":"#N/A"},{"$error":"#N/A"},{"$error":"#N/A"},{"$error":"#N/A"}]
[2020,4,3,0,43923.999999999884,{"$f":"NA()","v":{"$error":"#N/A"}},"Invalid",{"$f":"-NA()","v":{"$error":"#N/A"}},{"$f":"NA()","v":{"$error":"#N/A"}},"Invalid",{"$f":"NA()","v":{"$error":"#N/A"}},"Calibration Error","value outside range",{"$error":"#N/A"},{"$error":"#N/A"},{"$error":"#N/A"},{"$error":"#N/A"}]
[2020,4,3,1,43924.041666666548,13.7,"Valid",16.2,14.5,"Valid",17.5,null,null,13.7,16.2,14.5,17.5,14.5,17.5,13.7,16.2]
[2020,4,3,2,43924.083333333212,13.6,"Valid",16,15.9,"Valid",17.3,null,null,13.6,16,15.9,17.3,15.9,17.3,13.6,16]
[2020,4,3,3,43924.124999999876,14,"Valid",16,17.5,"Valid",17.399999999999999,null,null,14,16,17.5,17.399999999999999,17.5,17.399999999999999,14,16]
[2020,4,3,4,43924.166666666541,10.4,"Valid",15.6,15.1,"Valid",17.2,null,null,10.4,15.6,15.1,17.2,15.1,17.2,10.4,15.6]
[2020,4,3,5,43924.208333333205,17.100000000000001,"Valid",15.5,22.2,"Valid",17.3,null,null,17.100000000000001,15.5,22.2,17.3,22.2,17.3,17.100000000000001,15.5]
[2020,4,3,6,43924.249999999869,13.4,"Valid",15.4,18.899999999999999,"Valid",17.399999999999999,null,null,13.4,15.4,18.899999999999999,17.399999999999999,18.899999999999999,17.399999999999999,13.4,15.4]
[2020,4,3,7,43924.291666666533,6.7,"Valid",14.8,11.2,"Valid",17,null,null,6.7,14.8,11.2,17,11.2,17,6.7,14.8]
[2020,4,3,8,43924.333333333198,4.8,"Valid",14.3,7.1,"Valid",16.5,null,null,4.8,14.3,7.1,16.5,7.1,16.5,4.8,14.3]
[2020,4,3,9,43924.374999999862,20.6,"Valid",14.4,21.3,"Valid",16.600000000000001,null,null,20.6,14.4,21.3,16.600000000000001,21.3,16.600000000000001,20.6,14.4]
[2020,4,3,10,43924.416666666526,24.9,"Valid",15.2,27.9,"Valid",17.3,null,null,24.9,15.2,27.9,17.3,27.9,17.3,24.9,15.2]
[2020,4,3,11,43924.45833333319,0.4,"Valid",14.5,6.7,"Valid",16.7,null,null,0.4,14.5,6.7,16.7,6.7,16.7,0.4,14.5]
[2020,4,3,12,43924.499999999854,4.5999999999999996,"Valid",13.9,9.1,"Valid",16.3,null,null,4.5999999999999996,13.9,9.1,16.3,9.1,16.3,4.5999999999999996,13.9]
[2020,4,3,13,43924.541666666519,14.8,"Valid",14.3,20.9,"Valid",16.7,null,null,14.8,14.3,20.9,16.7,20.9,16.7,14.8,14.3]
[2020,4,3,14,43924.583333333183,12.1,"Valid",14.4,17.5,"Valid",16.899999999999999,null,null,12.1,14.4,17.5,16.899999999999999,17.5,16.899999999999999,12.1,14.4]
[2020,4,3,15,43924.624999999847,{"$f":"NA()","v":{"$error":"#N/A"}},"Invalid",{"$f":"NA()","v":{"$error":"#N/A"}},{"$f":"NA()","v":{"$error":"#N/A"}},"Invalid",{"$f":"NA()","v":{"$error":"#N/A"}},"Calibration Error","value outside range",{"$error":"#N/A"},{"$error":"#N/A"},{"$error":"#N/A"},{"$error":"#N/A"}]
[2020,4,3,16,43924.666666666511,{"$f":"NA()","v":{"$error":"#N/A"}},"Invalid",{"$f":"NA()","v":{"$error":"#N/A"}},{"$f":"NA()","v":{"$error":"#N/A"}},"Invalid",{"$f":"NA()","v":{"$error":"#N/A"}},"Calibration Error","value outside range",{"$f":"IF(G66=\"Valid\", F66, NA())","v":{"$error":"#N/A"}},{"$f":"IF(G66=\"Valid\", H66, NA())","v":{"$error":"#N/A"}},{"$f":"IF(J66=\"Valid\", I66, NA())","v":{"$error":"#N/A"}},{"$f":"IF(J66=\"Valid\", K66, NA())","v":{"$error":"#N/A"}}]
[2020,4,3,17,43924.708333333176,{"$f":"NA()","v":{"$error":"#N/A"}},"Invalid",{"$f":"NA()","v":{"$error":"#N/A"}},{"$f":"NA()","v":{"$error":"#N/A"}},"Invalid",{"$f":"NA()","v":{"$error":"#N/A"}},"Calibration Error","value outside range",{"$error":"#N/A"},{"$error":"#N/A"},{"$error":"#N/A"},{"$error":"#N/A"}]
[{"$f":"A67","v":2020},4,3,{"$f":"IF(D67=23,0,D67+1)","v":18},{"$f":"E67+0.0416666666666666","v":43924.74999999984},{"$f":"NA()","v":{"$error":"#N/A"}},"Invalid",{"$f":"NA()","v":{"$error":"#N/A"}},{"$f":"NA()","v":{"$error":"#N/A"}},"Invalid",{"$f":"NA()","v":{"$error":"#N/A"}},"Calibration Error","value outside range",{"$error":"#N/A"},{"$error":"#N/A"},{"$error":"#N/A"},{"$error":"#N/A"}]
[2020,4,3,19,43924.791666666504,{"$f":"NA()","v":{"$error":"#N/A"}},"Invalid",{"$f":"NA()","v":{"$error":"#N/A"}},{"$f":"NA()","v":{"$error":"#N/A"}},"Invalid",{"$f":"NA()","v":{"$error":"#N/A"}},"Calibration Error","value outside range",{"$error":"#N/A"},{"$error":"#N/A"},{"$error":"#N/A"},{"$error":"#N/A"}]
[2020,4,3,20,43924.833333333168,{"$f":"NA()","v":{"$error":"#N/A"}},"Invalid",{"$f":"NA()","v":{"$error":"#N/A"}},{"$f":"NA()","v":{"$error":"#N/A"}},"Invalid",{"$f":"NA()","v":{"$error":"#N/A"}},"Calibration Error","value outside range",{"$error":"#N/A"},{"$error":"#N/A"},{"$error":"#N/A"},{"$error":"#N/A"}]
[2020,4,3,21,43924.874999999833,{"$f":"NA()","v":{"$error":"#N/A"}},"Invalid",{"$f":"NA()","v":{"$error":"#N/A"}},{"$f":"NA()","v":{"$error":"#N/A"}},"Invalid",{"$f":"NA()","v":{"$error":"#N/A"}},"Calibration Error","value outside range",{"$error":"#N/A"},{"$error":"#N/A"},{"$error":"#N/A"},{"$error":"#N/A"}]
[2020,4,3,22,43924.916666666497,{"$f":"NA()","v":{"$error":"#N/A"}},"Invalid",{"$f":"NA()","v":{"$error":"#N/A"}},{"$f":"NA()","v":{"$error":"#N/A"}},"Invalid",{"$f":"NA()","v":{"$error":"#N/A"}},"Calibration Error","value outside range",{"$error":"#N/A"},{"$error":"#N/A"},{"$error":"#N/A"},{"$error":"#N/A"}]
[2020,4,3,23,43924.958333333161,{"$f":"NA()","v":{"$error":"#N/A"}},"Invalid",{"$f":"NA()","v":{"$error":"#N/A"}},{"$f":"NA()","v":{"$error":"#N/A"}},"Invalid",{"$f":"NA()","v":{"$error":"#N/A"}},"Calibration Error","value outside range",{"$error":"#N/A"},{"$error":"#N/A"},{"$error":"#N/A"},{"$error":"#N/A"}]
[2020,4,4,0,43924.999999999825,{"$f":"NA()","v":{"$error":"#N/A"}},"Invalid",{"$f":"NA()","v":{"$error":"#N/A"}},{"$f":"NA()","v":{"$error":"#N/A"}},"Invalid",{"$f":"NA()","v":{"$error":"#N/A"}},"Calibration Error","value outside range",{"$error":"#N/A"},{"$error":"#N/A"},{"$error":"#N/A"},{"$error":"#N/A"}]
[2020,4,4,1,43925.04166666649,{"$f":"NA()","v":{"$error":"#N/A"}},"Invalid",{"$f":"NA()","v":{"$error":"#N/A"}},{"$f":"NA()","v":{"$error":"#N/A"}},"Invalid",{"$f":"NA()","v":{"$error":"#N/A"}},"Calibration Error","value outside range",{"$error":"#N/A"},{"$error":"#N/A"},{"$error":"#N/A"},{"$error":"#N/A"}]
[2020,4,4,2,43925.083333333154,{"$f":"NA()","v":{"$error":"#N/A"}},"Invalid",{"$f":"NA()","v":{"$error":"#N/A"}},{"$f":"NA()","v":{"$error":"#N/A"}},"Invalid",{"$f":"NA()","v":{"$error":"#N/A"}},"Calibration Error","value outside range",{"$error":"#N/A"},{"$error":"#N/A"},{"$error":"#N/A"},{"$error":"#N/A"}]
[2020,4,4,3,43925.124999999818,{"$f":"NA()","v":{"$error":"#N/A"}},"Invalid",{"$f":"NA()","v":{"$error":"#N/A"}},{"$f":"NA()","v":{"$error":"#N/A"}},"Invalid",{"$f":"NA()","v":{"$error":"#N/A"}},"Calibration Error","value outside range",{"$error":"#N/A"},{"$error":"#N/A"},{"$error":"#N/A"},{"$error":"#N/A"}]
[2020,4,4,4,43925.166666666482,{"$f":"NA()","v":{"$error":"#N/A"}},"Invalid",{"$f":"NA()","v":{"$error":"#N/A"}},{"$f":"NA()","v":{"$error":"#N/A"}},"Invalid",{"$f":"NA()","v":{"$error":"#N/A"}},"Calibration Error","value outside range",{"$error":"#N/A"},{"$error":"#N/A"},{"$error":"#N/A"},{"$error":"#N/A"}]
[2020,4,4,5,43925.208333333147,{"$f":"NA()","v":{"$error":"#N/A"}},"Invalid",{"$f":"NA()","v":{"$error":"#N/A"}},{"$f":"NA()","v":{"$error":"#N/A"}},"Invalid",{"$f":"NA()","v":{"$error":"#N/A"}},"Calibration Error","value outside range",{"$error":"#N/A"},{"$error":"#N/A"},{"$error":"#N/A"},{"$error":"#N/A"}]
[2020,4,4,6,43925.249999999811,{"$f":"NA()","v":{"$error":"#N/A"}},"Invalid",{"$f":"NA()","v":{"$error":"#N/A"}},{"$f":"NA()","v":{"$error":"#N/A"}},"Invalid",{"$f":"NA()","v":{"$error":"#N/A"}},"Calibration Error","value outside range",{"$error":"#N/A"},{"$error":"#N/A"},{"$error":"#N/A"},{"$error":"#N/A"}]
{"$rows_left_out":666}
{"sheet":"Raw data_format","index":4,"n_rows":8,"n_cols":6,"rows_kept":8,"cut":false,"hidden":false,"merged":[]}
["Parameter","Format","Comment","Units of measure","Minimum","Maximum"]
["Year","yyyy","4 integer format","Not applicable",2015,"Until reporting ceases"]
["Month","mm","2 integer format","Not applicable",1,12]
["Day","dd","2 integer format","Not applicable",1,31]
["Hour","hh","2 integer format","Not applicable",0,23]
["PM10",0,"1 decimal place resolution","µg/m3","Negative","Instrument specific"]
["PM2.5",0,"2 decimal place resolution","µg/m3","Negative","Instrument specific"]
["Status","Text","7 character format","Not applicable","Valid","Invalid"]