{"text_format":"1","workbook":"xlsx","n_sheets":8,"sheets":["Instructions","Meta data_sheet","Meta data_lookup","Raw data_sheet","Raw data_format","24hr_PM10_chart","24hr_PM2.5_chart","Sheet1"],"not_rendered":{"charts":4,"images":0,"macros":1,"external_links":0,"defined_names":10,"comments":0,"pivot_tables":0},"unopened":[{"sheet":"24hr_PM10_chart","index":5,"reason":"not_a_worksheet"},{"sheet":"24hr_PM2.5_chart","index":6,"reason":"not_a_worksheet"}],"bounds":{"document_bytes":16777216,"sheet_cells":100000,"rows_first":2000,"rows_last":500,"rows_between":2000,"halvings":0,"cell_chars":16384,"cell_head_chars":4096},"cells_cut":0,"cells_raw":0,"read":"whole","date_system":"1900"}

{"sheet":"Instructions","index":0,"n_rows":0,"n_cols":0,"rows_kept":0,"cut":false,"hidden":false,"merged":[]}

{"sheet":"Meta data_sheet","index":1,"n_rows":17,"n_cols":5,"rows_kept":17,"cut":false,"hidden":false,"merged":[[18,0,18,1],[16,0,16,1]]}
["Ambient Monitoring Station","Details",null,"Ambient Monitoring Results","Details"]
["Location","Maules Creek",null,"PM2.5 monitoring start (dd/mm/yyyy hh:mm)","2023-08-01"]
["Easting",{"$f":"VLOOKUP($B$2,'Meta data_lookup'!$A$2:$D$5,2,FALSE)","v":225302},null,"PM2.5 monitoring end","2023-09-01"]
["Northing",{"$f":"VLOOKUP($B$2,'Meta data_lookup'!$A$2:$D$5,3,FALSE)","v":6623037},null,"PM2.5 monitoring period (h)",{"$f":"(E3-E2)*24","v":744}]
["Site elevation (m)",{"$f":"VLOOKUP($B$2,'Meta data_lookup'!$A$2:$D$5,4,FALSE)","v":"ND"},null,"Number of valid PM2.5 results",{"$f":"COUNTIF('Raw data_sheet'!G2:G673,\"Valid\")","v":654}]
["Description of surrounding land use","Agriculture/Mining",null,"Proportion of valid PM2.5 results (%)",{"$f":"E5/E4","v":0.87903225806451613}]
["Typical sources impacting on the site","Agriculture/Mining/Unsealed Roads",null,"PM10 monitoring start (dd/mm/yyyy hh:mm)","2023-08-01"]
["Site compliance with AS/NZS 3580.1.1:2007","Yes",null,"PM10 monitoring end","2023-09-01"]
["PM2.5 method compliance with AS/NZS 3580.9.13:2013\n","Yes",null,"PM10 monitoring period (h)",{"$f":"(E8-E7)*24","v":744}]
["PM2.5 instrument make","Thermo Scientific",null,"Number of valid PM10 results",{"$f":"COUNTIF('Raw data_sheet'!J2:J673,\"Valid\")","v":659}]
["PM2.5 instrument model","1405DF",null,"Proportion of valid PM10 results (%)",{"$f":"E10/E9","v":0.885752688172043}]
["PM2.5 instrument intake height (m)",3.5]
["PM10 method compliance with AS 3580.9.8-2008\n","No*"]
["PM10 instrument make","Thermo Scientific"]
["PM10 instrument model","1405DF"]
["PM10 instrument intake height (m)",3.5]
["*The 1405DF TEOM used at this site measures PM10 indirectly rather than directly. The unit does however meet the intent of AS 3580.9.8-2008, and this method has been accredited by the USEPA. It is considered scientifically robust and is used extensively throughout NSW with EPA's knowledge and informal acceptance."]

{"sheet":"Meta data_lookup","index":2,"n_rows":5,"n_cols":4,"rows_kept":5,"cut":false,"hidden":false,"merged":[]}
["Location","Easting","Northing","Site elevation (m)"]
["Maules Creek",225302,6623037,"ND"]
["Breeza",237993,6542606,"ND"]
["Will-gai",231804,6596392,"ND"]
["Werris Creek",276783,6528734,"ND"]

{"sheet":"Raw data_sheet","index":3,"n_rows":745,"n_cols":21,"rows_kept":745,"cut":false,"hidden":false,"merged":[]}
["Year","Month","Day","Hour","Date and time","PM2.5_hourly","PM2.5_Data_Status","PM2.5_24hr_rolling_average","PM10_hourly","PM10_Data_Status","PM10_24hr_rolling_average","Cause of data invalidity, if applicable","Detailed comments","PM2.5_hourly_valid_plot","PM2.5_24hr_rolling_ave_valid_plot","PM10_hourly_valid_plot","PM10_24hr_rolling_ave_valid_plot","PM10_hourly_valid_plot_series","PM10_24hr_rolling_average_valid_plot_series","PM2.5_hourly_valid_plot_series","PM2.5_24hr_rolling_average_valid_plot_series"]
[2023,8,1,0,{"$f":"DATE(A2,B2,C2)+TIME(D2,0,0)","v":45139},3.4,"Valid",0.92374999999999996,5.14,"Valid",6.7208333333333323,"","",{"$f":"IF(G2=\"Valid\", F2, NA())","v":3.4},{"$f":"IF(G2=\"Valid\", H2, NA())","v":0.92374999999999996},{"$f":"IF(J2=\"Valid\", I2, NA())","v":5.14},{"$f":"IF(J2=\"Valid\", K2, NA())","v":6.7208333333333323},5.14,6.7208333333333323,3.4,0.92374999999999996]
[{"$f":"A2","v":2023},8,{"$f":"C2","v":1},{"$f":"IF(D2=23,0,D2+1)","v":1},{"$f":"E2+0.0416666666666666","v":45139.041666666664},3.35,"Valid",1.0504166666666668,5.8,"Valid",6.7758333333333338,"","",{"$f":"IF(G3=\"Valid\", F3, NA())","v":3.35},{"$f":"IF(G3=\"Valid\", H3, NA())","v":1.0504166666666668},5.8,6.7758333333333338,5.8,6.7758333333333338,3.35,1.0504166666666668]
[{"$f":"A3","v":2023},8,{"$f":"C3","v":1},{"$f":"IF(D3=23,0,D3+1)","v":2},{"$f":"E3+0.0416666666666666","v":45139.083333333328},1.08,"Valid",1.0875000000000001,2.83,"Valid",6.717083333333334,"","",1.08,1.0875000000000001,2.83,6.717083333333334,2.83,6.717083333333334,1.08,1.0875000000000001]
[2023,8,1,3,45139.124999999993,6.42,"Valid",1.2870833333333334,8.26,"Valid",6.8620833333333335,"","",6.42,1.2870833333333334,8.26,6.8620833333333335,8.26,6.8620833333333335,6.42,1.2870833333333334]
[2023,8,1,4,45139.166666666657,7.13,"Valid",1.4037500000000003,8.5,"Valid",6.9333333333333336,"","",7.13,1.4037500000000003,8.5,6.9333333333333336,8.5,6.9333333333333336,7.13,1.4037500000000003]
[2023,8,1,5,45139.208333333321,1.98,"Valid",1.4620833333333334,3.82,"Valid",6.9491666666666667,"","",1.98,1.4620833333333334,3.82,6.9491666666666667,3.82,6.9491666666666667,1.98,1.4620833333333334]
[2023,8,1,6,45139.249999999985,2.4900000000000002,"Valid",1.6195833333333336,4.37,"Valid",7.0487499999999992,"","",2.4900000000000002,1.6195833333333336,4.37,7.0487499999999992,4.37,7.0487499999999992,2.4900000000000002,1.6195833333333336]
[2023,8,1,7,45139.29166666665,-1.1599999999999999,"Valid",1.5304166666666672,0.72,"Valid",6.9337499999999999,"","",-1.1599999999999999,1.5304166666666672,0.72,6.9337499999999999,0.72,6.9337499999999999,-1.1599999999999999,1.5304166666666672]
[2023,8,1,8,45139.333333333314,0.49,"Valid",1.5779166666666671,2.2799999999999998,"Valid",6.9554166666666672,"","",0.49,1.5779166666666671,2.2799999999999998,6.9554166666666672,2.2799999999999998,6.9554166666666672,0.49,1.5779166666666671]
[2023,8,1,9,45139.374999999978,-0.52,"Valid",1.5616666666666668,3.38,"Valid",6.9524999999999997,"","",-0.52,1.5616666666666668,3.38,6.9524999999999997,3.38,6.9524999999999997,-0.52,1.5616666666666668]
[2023,8,1,10,45139.416666666642,2.0699999999999998,"Valid",1.6870833333333337,5.04,"Valid",6.864583333333333,"","",2.0699999999999998,1.6870833333333337,5.04,6.864583333333333,5.04,6.864583333333333,2.0699999999999998,1.6870833333333337]
[2023,8,1,11,45139.458333333307,-0.84,"Valid",1.6304166666666668,2.1800000000000002,"Valid",6.4191666666666665,"","",-0.84,1.6304166666666668,2.1800000000000002,6.4191666666666665,2.1800000000000002,6.4191666666666665,-0.84,1.6304166666666668]
[2023,8,1,12,45139.499999999971,0.44,"Valid",1.63,4.8,"Valid",6.1941666666666668,"","",0.44,1.63,4.8,6.1941666666666668,4.8,6.1941666666666668,0.44,1.63]
[2023,8,1,13,45139.541666666635,1.89,"Valid",1.71875,22.41,"Valid",6.8116666666666665,"","",1.89,1.71875,22.41,6.8116666666666665,22.41,6.8116666666666665,1.89,1.71875]
[2023,8,1,14,45139.583333333299,1.88,"Valid",1.8425000000000002,23.29,"Valid",7.7029166666666669,"","",1.88,1.8425000000000002,23.29,7.7029166666666669,23.29,7.7029166666666669,1.88,1.8425000000000002]
[2023,8,1,15,45139.624999999964,2.88,"Valid",2.0275000000000003,22.82,"Valid",8.6174999999999997,"","",2.88,2.0275000000000003,22.82,8.6174999999999997,22.82,8.6174999999999997,2.88,2.0275000000000003]
[2023,8,1,16,45139.666666666628,1.9,"Valid",2.1266666666666669,21.14,"Valid",9.3183333333333334,"","",1.9,2.1266666666666669,21.14,9.3183333333333334,21.14,9.3183333333333334,1.9,2.1266666666666669]
[2023,8,1,17,45139.708333333292,2.72,"Valid",2.1520833333333336,20.78,"Valid",9.6904166666666658,"","",2.72,2.1520833333333336,20.78,9.6904166666666658,20.78,9.6904166666666658,2.72,2.1520833333333336]
[2023,8,1,18,45139.749999999956,4.13,"Valid",2.3366666666666669,18.09,"Valid",10.214166666666666,"","",4.13,2.3366666666666669,18.09,10.214166666666666,18.09,10.214166666666666,4.13,2.3366666666666669]
[2023,8,1,19,45139.791666666621,1.68,"Valid",2.124166666666667,29.66,"Valid",10.253333333333334,"","",1.68,2.124166666666667,29.66,10.253333333333334,29.66,10.253333333333334,1.68,2.124166666666667]
[2023,8,1,20,45139.833333333285,3.65,"Valid",2.2004166666666669,20.62,"Valid",10.649583333333334,"","",3.65,2.2004166666666669,20.62,10.649583333333334,20.62,10.649583333333334,3.65,2.2004166666666669]
[2023,8,1,21,45139.874999999949,1.62,"Valid",2.2158333333333333,14.6,"Valid",10.994583333333333,"","",1.62,2.2158333333333333,14.6,10.994583333333333,14.6,10.994583333333333,1.62,2.2158333333333333]
[2023,8,1,22,45139.916666666613,-0.12,"Valid",2.1741666666666668,4.97,"Valid",10.906666666666666,"","",-0.12,2.1741666666666668,4.97,10.906666666666666,4.97,10.906666666666666,-0.12,2.1741666666666668]
[2023,8,{"$f":"C24","v":1},23,45139.958333333278,1.44,"Valid",2.0833333333333335,4.28,"Valid",10.824166666666665,"","",1.44,2.0833333333333335,4.28,10.824166666666665,4.28,10.824166666666665,1.44,2.0833333333333335]
[2023,8,{"$f":"C2+1","v":2},0,45139.999999999942,2.1800000000000002,"Valid",2.0325000000000002,5.41,"Valid",10.835416666666667,"","",2.1800000000000002,2.0325000000000002,5.41,10.835416666666667,5.41,10.835416666666667,2.1800000000000002,2.0325000000000002]
[2023,8,{"$f":"C3+1","v":2},1,45140.041666666606,2.08,"Valid",1.979583333333333,5.37,"Valid",10.817499999999997,"","",2.08,1.979583333333333,5.37,10.817499999999997,5.37,10.817499999999997,2.08,1.979583333333333]
[2023,8,2,2,45140.08333333327,3.76,"Valid",2.0912499999999996,6.93,"Valid",10.988333333333332,"","",3.76,2.0912499999999996,6.93,10.988333333333332,6.93,10.988333333333332,3.76,2.0912499999999996]
[2023,8,2,3,45140.124999999935,-0.77,"Valid",1.7916666666666661,2.4700000000000002,"Valid",10.747083333333334,"","",-0.77,1.7916666666666661,2.4700000000000002,10.747083333333334,2.4700000000000002,10.747083333333334,-0.77,1.7916666666666661]
[2023,8,2,4,45140.166666666599,3.65,"Valid",1.6466666666666665,6.64,"Valid",10.669583333333334,"","",3.65,1.6466666666666665,6.64,10.669583333333334,6.64,10.669583333333334,3.65,1.6466666666666665]
[2023,8,2,5,45140.208333333263,3.68,"Valid",1.7174999999999996,7.39,"Valid",10.818333333333333,"","",3.68,1.7174999999999996,7.39,10.818333333333333,7.39,10.818333333333333,3.68,1.7174999999999996]
[2023,8,2,6,45140.249999999927,9.25,"Valid",1.9991666666666665,12.12,"Valid",11.141249999999998,"","",9.25,1.9991666666666665,12.12,11.141249999999998,12.12,11.141249999999998,9.25,1.9991666666666665]
[2023,8,2,7,45140.291666666591,1.31,"Valid",2.1020833333333333,5.56,"Valid",11.342916666666666,"","",1.31,2.1020833333333333,5.56,11.342916666666666,5.56,11.342916666666666,1.31,2.1020833333333333]
[2023,8,2,8,45140.333333333256,2.37,"Valid",2.1804166666666664,6.65,"Valid",11.524999999999999,"","",2.37,2.1804166666666664,6.65,11.524999999999999,6.65,11.524999999999999,2.37,2.1804166666666664]
[2023,8,2,9,45140.37499999992,3.63,"Valid",2.3533333333333331,8.75,"Valid",11.748749999999996,"","",3.63,2.3533333333333331,8.75,11.748749999999996,8.75,11.748749999999996,3.63,2.3533333333333331]
[2023,8,2,10,45140.416666666584,0.13,"Valid",2.2725000000000004,5.88,"Valid",11.783749999999998,"","",0.13,2.2725000000000004,5.88,11.783749999999998,5.88,11.783749999999998,0.13,2.2725000000000004]
[2023,8,2,11,45140.458333333248,-1.43,"Valid",2.2479166666666668,3.74,"Valid",11.848749999999997,"","",-1.43,2.2479166666666668,3.74,11.848749999999997,3.74,11.848749999999997,-1.43,2.2479166666666668]
[2023,8,2,12,45140.499999999913,-2,"Valid",2.1462500000000002,1.43,"Valid",11.708333333333334,"","",-2,2.1462500000000002,1.43,11.708333333333334,1.43,11.708333333333334,-2,2.1462500000000002]
[2023,8,2,13,45140.541666666577,-0.5,"Valid",2.0466666666666669,3.86,"Valid",10.935416666666667,"","",-0.5,2.0466666666666669,3.86,10.935416666666667,3.86,10.935416666666667,-0.5,2.0466666666666669]
[2023,8,2,14,45140.583333333241,-2.57,"Valid",1.8612500000000001,0.86,"Valid",10.000833333333334,"","",-2.57,1.8612500000000001,0.86,10.000833333333334,0.86,10.000833333333334,-2.57,1.8612500000000001]
[2023,8,2,15,45140.624999999905,-3.61,"Valid",1.5908333333333333,1.72,"Valid",9.1216666666666679,"","",-3.61,1.5908333333333333,1.72,9.1216666666666679,1.72,9.1216666666666679,-3.61,1.5908333333333333]
[2023,8,2,16,45140.66666666657,-2.23,"Valid",1.4187500000000004,6.44,"Valid",8.5091666666666672,"","",-2.23,1.4187500000000004,6.44,8.5091666666666672,6.44,8.5091666666666672,-2.23,1.4187500000000004]
[2023,8,2,17,45140.708333333234,-2.93,"Valid",1.1833333333333331,16.829999999999998,"Valid",8.3445833333333344,"","",-2.93,1.1833333333333331,16.829999999999998,8.3445833333333344,16.829999999999998,8.3445833333333344,-2.93,1.1833333333333331]
[2023,8,2,18,45140.749999999898,-4.68,"Valid",0.81625000000000003,1.61,"Valid",7.6579166666666696,"","",-4.68,0.81625000000000003,1.61,7.6579166666666696,1.61,7.6579166666666696,-4.68,0.81625000000000003]
[2023,8,2,19,45140.791666666562,-7.74,"Valid",0.42375000000000002,0.43,"Valid",6.44,"","",-7.74,0.42375000000000002,0.43,6.44,0.43,6.44,-7.74,0.42375000000000002]
[2023,8,2,20,45140.833333333227,-6.81,"Valid",-1.2083333333332965E-2,0.2,"Valid",5.5891666666666673,"","",-6.81,{"$f":"IF(G46=\"Valid\", H46, NA())","v":-1.2083333333332965E-2},{"$f":"IF(J46=\"Valid\", I46, NA())","v":0.2},5.5891666666666673,0.2,5.5891666666666673,-6.81,-1.2083333333332965E-2]
[2023,8,2,21,45140.874999999891,-6.66,"Valid",-0.3570833333333332,-1.03,"Valid",4.9379166666666672,"","",-6.66,-0.3570833333333332,-1.03,4.9379166666666672,-1.03,4.9379166666666672,-6.66,-0.3570833333333332]
[2023,8,2,22,45140.916666666555,-7.15,"Valid",-0.64999999999999969,-1.24,"Valid",4.6791666666666663,"","",-7.15,-0.64999999999999969,-1.24,4.6791666666666663,-1.24,4.6791666666666663,-7.15,-0.64999999999999969]
[2023,8,2,23,45140.958333333219,-9.0500000000000007,"Valid",-1.0870833333333336,-3.78,"Valid",4.3433333333333328,"","",-9.0500000000000007,-1.0870833333333336,-3.78,4.3433333333333328,-3.78,4.3433333333333328,-9.0500000000000007,-1.0870833333333336]
[2023,8,3,0,45140.999999999884,-6.72,"Valid",-1.457916666666667,-2.08,"Valid",4.0312500000000009,"","",-6.72,-1.457916666666667,-2.08,4.0312500000000009,-2.08,4.0312500000000009,-6.72,-1.457916666666667]
[2023,8,3,1,45141.041666666548,-6.56,"Valid",-1.8179166666666671,-2.11,"Valid",3.7195833333333339,"","",-6.56,-1.8179166666666671,-2.11,3.7195833333333339,-2.11,3.7195833333333339,-6.56,-1.8179166666666671]
[2023,8,3,2,45141.083333333212,-7.12,"Valid",-2.2712499999999998,-3.06,"Valid",3.3033333333333341,"","",-7.12,-2.2712499999999998,-3.06,3.3033333333333341,-3.06,3.3033333333333341,-7.12,-2.2712499999999998]
[2023,8,3,3,45141.124999999876,-9.27,"Valid",-2.6254166666666667,-4.8600000000000003,"Valid",2.9979166666666672,"","",-9.27,-2.6254166666666667,-4.8600000000000003,2.9979166666666672,-4.8600000000000003,2.9979166666666672,-9.27,-2.6254166666666667]
[2023,8,3,4,45141.166666666541,-6.17,"Valid",-3.0345833333333339,-2.62,"Valid",2.612083333333334,"","",-6.17,-3.0345833333333339,-2.62,2.612083333333334,-2.62,2.612083333333334,-6.17,-3.0345833333333339]
[2023,8,3,5,45141.208333333205,-5.71,"Valid",-3.4258333333333333,-0.13,"Valid",2.2987500000000005,"","",-5.71,-3.4258333333333333,-0.13,2.2987500000000005,-0.13,2.2987500000000005,-5.71,-3.4258333333333333]
[2023,8,3,6,45141.249999999869,-4.05,"Valid",-3.98,1.18,"Valid",1.8429166666666663,"","",-4.05,-3.98,1.18,1.8429166666666663,1.18,1.8429166666666663,-4.05,-3.98]
[2023,8,3,7,45141.291666666533,-7,"Valid",-4.3262499999999999,-2.2799999999999998,"Valid",1.5162499999999997,"","",-7,-4.3262499999999999,-2.2799999999999998,1.5162499999999997,-2.2799999999999998,1.5162499999999997,-7,-4.3262499999999999]
[2023,8,3,8,45141.333333333198,-5.87,"Valid",-4.6695833333333328,-1.71,"Valid",1.167916666666666,"","",-5.87,-4.6695833333333328,-1.71,1.167916666666666,-1.71,1.167916666666666,-5.87,-4.6695833333333328]
[2023,8,3,9,45141.374999999862,-9.39,"Valid",-5.2120833333333332,-4.5599999999999996,"Valid",0.61333333333333329,"","",-9.39,-5.2120833333333332,-4.5599999999999996,0.61333333333333329,-4.5599999999999996,0.61333333333333329,-9.39,-5.2120833333333332]
[2023,8,3,10,45141.416666666526,"","Invalid",-5.4443478260869567,-9.41,"Valid",-2.3750000000000011E-2,"Calibration Error","High negatives removed",{"$error":"#N/A"},{"$error":"#N/A"},-9.41,-2.3750000000000011E-2,-9.41,-2.3750000000000011E-2]
[2023,8,3,11,45141.45833333319,"","Invalid",-5.6268181818181819,-8.67,"Valid",-0.54083333333333339,"Calibration Error","High negatives removed",{"$error":"#N/A"},{"$error":"#N/A"},-8.67,-0.54083333333333339,-8.67,-0.54083333333333339]
[2023,8,3,12,45141.499999999854,"","Invalid",-5.7995238095238095,"","Invalid",-0.62652173913043507,"Calibration Error","High negatives removed",{"$error":"#N/A"},{"$error":"#N/A"},{"$error":"#N/A"},{"$error":"#N/A"}]
[2023,8,3,13,45141.541666666519,"","Invalid",-6.0644999999999998,-4.54,"Valid",-0.9917391304347829,"Calibration Error","High negatives removed",{"$error":"#N/A"},{"$error":"#N/A"},-4.54,-0.9917391304347829,-4.54,-0.9917391304347829]
[2023,8,3,14,45141.583333333183,"","Invalid",-6.2484210526315787,-1.03,"Valid",-1.0739130434782611,"Calibration Error","High negatives removed",{"$error":"#N/A"},{"$error":"#N/A"},-1.03,-1.0739130434782611,-1.03,-1.0739130434782611]
[2023,8,3,15,45141.624999999847,"","Invalid",-6.3949999999999996,-0.09,"Valid",-1.1526086956521742,"Calibration Error","High negatives removed",{"$error":"#N/A"},{"$error":"#N/A"},-0.09,-1.1526086956521742,-0.09,-1.1526086956521742]
[2023,8,3,16,45141.666666666511,"","Invalid",{"$f":"NA()","v":{"$error":"#N/A"}},"","Invalid",-1.4977272727272728,"Calibration Error","System Reset & <18hr of valid 1hr data for 24-hr rolling average",{"$f":"IF(G66=\"Valid\", F66, NA())","v":{"$error":"#N/A"}},{"$f":"IF(G66=\"Valid\", H66, NA())","v":{"$error":"#N/A"}},{"$f":"IF(J66=\"Valid\", I66, NA())","v":{"$error":"#N/A"}},{"$f":"IF(J66=\"Valid\", K66, NA())","v":{"$error":"#N/A"}}]
[2023,8,3,17,45141.708333333176,"","Invalid",{"$f":"NA()","v":{"$error":"#N/A"}},"","Invalid",-2.3704761904761908,"Calibration Error","System Reset & <18hr of valid 1hr data for 24-hr rolling average",{"$error":"#N/A"},{"$error":"#N/A"},{"$error":"#N/A"},{"$error":"#N/A"}]
[{"$f":"A67","v":2023},8,3,{"$f":"IF(D67=23,0,D67+1)","v":18},{"$f":"E67+0.0416666666666666","v":45141.74999999984},"","Invalid",{"$f":"NA()","v":{"$error":"#N/A"}},"","Invalid",-2.5695000000000006,"Calibration Error","System Reset & <18hr of valid 1hr data for 24-hr rolling average",{"$error":"#N/A"},{"$error":"#N/A"},{"$error":"#N/A"},{"$error":"#N/A"}]
[2023,8,3,19,45141.791666666504,"","Invalid",{"$f":"NA()","v":{"$error":"#N/A"}},"","Invalid",-2.7273684210526321,"Calibration Error","System Reset & <18hr of valid 1hr data for 24-hr rolling average",{"$error":"#N/A"},{"$error":"#N/A"},{"$error":"#N/A"},{"$error":"#N/A"}]
[2023,8,3,20,45141.833333333168,"","Invalid",{"$f":"NA()","v":{"$error":"#N/A"}},"","Invalid",-2.89,"Calibration Error","System Reset & <18hr of valid 1hr data for 24-hr rolling average",{"$error":"#N/A"},{"$error":"#N/A"},{"$error":"#N/A"},{"$error":"#N/A"}]
[2023,8,3,21,45141.874999999833,2.0299999999999998,"Valid",{"$f":"NA()","v":{"$error":"#N/A"}},9.44,"Valid",-2.3083333333333336,"Calibration Error","<18hr of valid 1hr data for 24-hr rolling average",2.0299999999999998,{"$error":"#N/A"},9.44,-2.3083333333333336,9.44,-2.3083333333333336,2.0299999999999998]
[2023,8,3,22,45141.916666666497,3.71,"Valid",{"$f":"NA()","v":{"$error":"#N/A"}},8.36,"Valid",-1.7750000000000006,"Calibration Error","<18hr of valid 1hr data for 24-hr rolling average",3.71,{"$error":"#N/A"},8.36,-1.7750000000000006,8.36,-1.7750000000000006,3.71]
[2023,8,3,23,45141.958333333161,-0.85,"Valid",{"$f":"NA()","v":{"$error":"#N/A"}},3.4,"Valid",-1.3761111111111117,"Calibration Error","<18hr of valid 1hr data for 24-hr rolling average",-0.85,{"$error":"#N/A"},3.4,-1.3761111111111117,3.4,-1.3761111111111117,-0.85]
[2023,8,4,0,45141.999999999825,2.5,"Valid",{"$f":"NA()","v":{"$error":"#N/A"}},6.24,"Valid",-0.91388888888888942,"Calibration Error","<18hr of valid 1hr data for 24-hr rolling average",2.5,{"$error":"#N/A"},6.24,-0.91388888888888942,6.24,-0.91388888888888942,2.5]
[2023,8,4,1,45142.04166666649,2.36,"Valid",{"$f":"NA()","v":{"$error":"#N/A"}},5.43,"Valid",-0.49500000000000033,"Calibration Error","<18hr of valid 1hr data for 24-hr rolling average",2.36,{"$error":"#N/A"},5.43,-0.49500000000000033,5.43,-0.49500000000000033,2.36]
[2023,8,4,2,45142.083333333154,-0.79,"Valid",{"$f":"NA()","v":{"$error":"#N/A"}},1.34,"Valid",-0.25055555555555614,"Calibration Error","<18hr of valid 1hr data for 24-hr rolling average",-0.79,{"$error":"#N/A"},1.34,-0.25055555555555614,1.34,-0.25055555555555614,-0.79]
[2023,8,4,3,45142.124999999818,0.39,"Valid",{"$f":"NA()","v":{"$error":"#N/A"}},3.19,"Valid",0.19666666666666618,"Calibration Error","<18hr of valid 1hr data for 24-hr rolling average",0.39,{"$error":"#N/A"},3.19,0.19666666666666618,3.19,0.19666666666666618,0.39]
[2023,8,4,4,45142.166666666482,3.16,"Valid",{"$f":"NA()","v":{"$error":"#N/A"}},5.27,"Valid",0.63500000000000012,"Calibration Error","<18hr of valid 1hr data for 24-hr rolling average",3.16,{"$error":"#N/A"},5.27,0.63500000000000012,5.27,0.63500000000000012,3.16]
[2023,8,4,5,45142.208333333147,1.23,"Valid",{"$f":"NA()","v":{"$error":"#N/A"}},3.15,"Valid",0.81722222222222207,"Calibration Error","<18hr of valid 1hr data for 24-hr rolling average",1.23,{"$error":"#N/A"},3.15,0.81722222222222207,3.15,0.81722222222222207,1.23]
[2023,8,4,6,45142.249999999811,1.97,"Valid",{"$f":"NA()","v":{"$error":"#N/A"}},2.16,"Valid",0.87166666666666626,"Calibration Error","<18hr of valid 1hr data for 24-hr rolling average",1.97,{"$error":"#N/A"},2.16,0.87166666666666626,2.16,0.87166666666666626,1.97]
{"$rows_left_out":666}
{"sheet":"Raw data_format","index":4,"n_rows":8,"n_cols":6,"rows_kept":8,"cut":false,"hidden":false,"merged":[]}
["Parameter","Format","Comment","Units of measure","Minimum","Maximum"]
["Year","yyyy","4 integer format","Not applicable",2015,"Until reporting ceases"]
["Month","mm","2 integer format","Not applicable",1,12]
["Day","dd","2 integer format","Not applicable",1,31]
["Hour","hh","2 integer format","Not applicable",0,23]
["PM10",0,"1 decimal place resolution","µg/m3","Negative","Instrument specific"]
["PM2.5",0,"2 decimal place resolution","µg/m3","Negative","Instrument specific"]
["Status","Text","7 character format","Not applicable","Valid","Invalid"]

{"sheet":"Sheet1","index":7,"n_rows":0,"n_cols":0,"rows_kept":0,"cut":false,"hidden":false,"merged":[]}