{"text_format":"1","workbook":"xlsx","n_sheets":8,"sheets":["Instructions","Meta data_sheet","Meta data_lookup","Raw data_sheet","Raw data_format","24hr_PM10_chart","24hr_PM2.5_chart","Sheet1"],"not_rendered":{"charts":4,"images":0,"macros":1,"external_links":0,"defined_names":10,"comments":0,"pivot_tables":0},"unopened":[{"sheet":"24hr_PM10_chart","index":5,"reason":"not_a_worksheet"},{"sheet":"24hr_PM2.5_chart","index":6,"reason":"not_a_worksheet"}],"bounds":{"document_bytes":16777216,"sheet_cells":100000,"rows_first":2000,"rows_last":500,"rows_between":2000,"halvings":0,"cell_chars":16384,"cell_head_chars":4096},"cells_cut":0,"cells_raw":0,"read":"whole","date_system":"1900"}

{"sheet":"Instructions","index":0,"n_rows":0,"n_cols":0,"rows_kept":0,"cut":false,"hidden":false,"merged":[]}

{"sheet":"Meta data_sheet","index":1,"n_rows":17,"n_cols":5,"rows_kept":17,"cut":false,"hidden":false,"merged":[[18,0,18,1],[16,0,16,1]]}
["Ambient Monitoring Station","Details",null,"Ambient Monitoring Results","Details"]
["Location","Maules Creek",null,"PM2.5 monitoring start (dd/mm/yyyy hh:mm)","2023-06-01"]
["Easting",{"$f":"VLOOKUP($B$2,'Meta data_lookup'!$A$2:$D$5,2,FALSE)","v":225302},null,"PM2.5 monitoring end","2023-07-01"]
["Northing",{"$f":"VLOOKUP($B$2,'Meta data_lookup'!$A$2:$D$5,3,FALSE)","v":6623037},null,"PM2.5 monitoring period (h)",{"$f":"(E3-E2)*24","v":720}]
["Site elevation (m)",{"$f":"VLOOKUP($B$2,'Meta data_lookup'!$A$2:$D$5,4,FALSE)","v":"ND"},null,"Number of valid PM2.5 results",{"$f":"COUNTIF('Raw data_sheet'!G2:G673,\"Valid\")","v":667}]
["Description of surrounding land use","Agriculture/Mining",null,"Proportion of valid PM2.5 results (%)",{"$f":"E5/E4","v":0.92638888888888893}]
["Typical sources impacting on the site","Agriculture/Mining/Unsealed Roads",null,"PM10 monitoring start (dd/mm/yyyy hh:mm)","2023-06-01"]
["Site compliance with AS/NZS 3580.1.1:2007","Yes",null,"PM10 monitoring end","2023-07-01"]
["PM2.5 method compliance with AS/NZS 3580.9.13:2013\n","Yes",null,"PM10 monitoring period (h)",{"$f":"(E8-E7)*24","v":720}]
["PM2.5 instrument make","Thermo Scientific",null,"Number of valid PM10 results",{"$f":"COUNTIF('Raw data_sheet'!J2:J673,\"Valid\")","v":667}]
["PM2.5 instrument model","1405DF",null,"Proportion of valid PM10 results (%)",{"$f":"E10/E9","v":0.92638888888888893}]
["PM2.5 instrument intake height (m)",3.5]
["PM10 method compliance with AS 3580.9.8-2008\n","No*"]
["PM10 instrument make","Thermo Scientific"]
["PM10 instrument model","1405DF"]
["PM10 instrument intake height (m)",3.5]
["*The 1405DF TEOM used at this site measures PM10 indirectly rather than directly. The unit does however meet the intent of AS 3580.9.8-2008, and this method has been accredited by the USEPA. It is considered scientifically robust and is used extensively throughout NSW with EPA's knowledge and informal acceptance."]

{"sheet":"Meta data_lookup","index":2,"n_rows":5,"n_cols":4,"rows_kept":5,"cut":false,"hidden":false,"merged":[]}
["Location","Easting","Northing","Site elevation (m)"]
["Maules Creek",225302,6623037,"ND"]
["Breeza",237993,6542606,"ND"]
["Will-gai",231804,6596392,"ND"]
["Werris Creek",276783,6528734,"ND"]

{"sheet":"Raw data_sheet","index":3,"n_rows":721,"n_cols":21,"rows_kept":721,"cut":false,"hidden":false,"merged":[]}
["Year","Month","Day","Hour","Date and time","PM2.5_hourly","PM2.5_Data_Status","PM2.5_24hr_rolling_average","PM10_hourly","PM10_Data_Status","PM10_24hr_rolling_average","Cause of data invalidity, if applicable","Detailed comments","PM2.5_hourly_valid_plot","PM2.5_24hr_rolling_ave_valid_plot","PM10_hourly_valid_plot","PM10_24hr_rolling_ave_valid_plot","PM10_hourly_valid_plot_series","PM10_24hr_rolling_average_valid_plot_series","PM2.5_hourly_valid_plot_series","PM2.5_24hr_rolling_average_valid_plot_series"]
[2023,6,1,0,{"$f":"DATE(A2,B2,C2)+TIME(D2,0,0)","v":45078},0.43,"Valid",3.3929166666666668,3,"Valid",7.4954166666666664,"","",{"$f":"IF(G2=\"Valid\", F2, NA())","v":0.43},{"$f":"IF(G2=\"Valid\", H2, NA())","v":3.3929166666666668},{"$f":"IF(J2=\"Valid\", I2, NA())","v":3},{"$f":"IF(J2=\"Valid\", K2, NA())","v":7.4954166666666664},3,7.4954166666666664,0.43,3.3929166666666668]
[{"$f":"A2","v":2023},6,{"$f":"C2","v":1},{"$f":"IF(D2=23,0,D2+1)","v":1},{"$f":"E2+0.0416666666666666","v":45078.041666666664},0.19,"Valid",3.0525000000000002,2.76,"Valid",7.1775000000000011,"","",{"$f":"IF(G3=\"Valid\", F3, NA())","v":0.19},{"$f":"IF(G3=\"Valid\", H3, NA())","v":3.0525000000000002},2.76,7.1775000000000011,2.76,7.1775000000000011,0.19,3.0525000000000002]
[{"$f":"A3","v":2023},6,{"$f":"C3","v":1},{"$f":"IF(D3=23,0,D3+1)","v":2},{"$f":"E3+0.0416666666666666","v":45078.083333333328},0.15,"Valid",2.7904166666666672,2.2200000000000002,"Valid",6.94625,"","",0.15,2.7904166666666672,2.2200000000000002,6.94625,2.2200000000000002,6.94625,0.15,2.7904166666666672]
[2023,6,1,3,45078.124999999993,3.68,"Valid",2.7754166666666666,5.2,"Valid",6.9083333333333341,"","",3.68,2.7754166666666666,5.2,6.9083333333333341,5.2,6.9083333333333341,3.68,2.7754166666666666]
[2023,6,1,4,45078.166666666657,2.04,"Valid",2.7729166666666671,4.0199999999999996,"Valid",6.9258333333333333,"","",2.04,2.7729166666666671,4.0199999999999996,6.9258333333333333,4.0199999999999996,6.9258333333333333,2.04,2.7729166666666671]
[2023,6,1,5,45078.208333333321,3.17,"Valid",2.73,5.3,"Valid",6.9016666666666673,"","",3.17,2.73,5.3,6.9016666666666673,5.3,6.9016666666666673,3.17,2.73]
[2023,6,1,6,45078.249999999985,3.19,"Valid",2.7770833333333336,4.63,"Valid",6.9358333333333322,"","",3.19,2.7770833333333336,4.63,6.9358333333333322,4.63,6.9358333333333322,3.19,2.7770833333333336]
[2023,6,1,7,45078.29166666665,2.39,"Valid",2.8925000000000001,3.64,"Valid",7.0387500000000003,"","",2.39,2.8925000000000001,3.64,7.0387500000000003,3.64,7.0387500000000003,2.39,2.8925000000000001]
[2023,6,1,8,45078.333333333314,5.64,"Valid",2.9933333333333327,7.82,"Valid",7.1516666666666646,"","",5.64,2.9933333333333327,7.82,7.1516666666666646,7.82,7.1516666666666646,5.64,2.9933333333333327]
[2023,6,1,9,45078.374999999978,5.04,"Valid",3.1579166666666669,7.45,"Valid",7.209583333333331,"","",5.04,3.1579166666666669,7.45,7.209583333333331,7.45,7.209583333333331,5.04,3.1579166666666669]
[2023,6,1,10,45078.416666666642,1.56,"Valid",3.1066666666666669,3.55,"Valid",7.1008333333333331,"","",1.56,3.1066666666666669,3.55,7.1008333333333331,3.55,7.1008333333333331,1.56,3.1066666666666669]
[2023,6,1,11,45078.458333333307,1.1000000000000001,"Valid",2.9954166666666668,5.54,"Valid",7.064166666666666,"","",1.1000000000000001,2.9954166666666668,5.54,7.064166666666666,5.54,7.064166666666666,1.1000000000000001,2.9954166666666668]
[2023,6,1,12,45078.499999999971,5.44,"Valid",3.1758333333333328,9.4700000000000006,"Valid",7.3162499999999993,"","",5.44,3.1758333333333328,9.4700000000000006,7.3162499999999993,9.4700000000000006,7.3162499999999993,5.44,3.1758333333333328]
[2023,6,1,13,45078.541666666635,6.01,"Valid",3.344583333333333,9.98,"Valid",7.5137499999999973,"","",6.01,3.344583333333333,9.98,7.5137499999999973,9.98,7.5137499999999973,6.01,3.344583333333333]
[2023,6,1,14,45078.583333333299,0.57999999999999996,"Valid",3.2374999999999994,3.46,"Valid",7.4316666666666649,"","",0.57999999999999996,3.2374999999999994,3.46,7.4316666666666649,3.46,7.4316666666666649,0.57999999999999996,3.2374999999999994]
[2023,6,1,15,45078.624999999964,4.49,"Valid",3.3674999999999997,8.25,"Valid",7.5474999999999994,"","",4.49,3.3674999999999997,8.25,7.5474999999999994,8.25,7.5474999999999994,4.49,3.3674999999999997]
[2023,6,1,16,45078.666666666628,6.62,"Valid",3.4770833333333333,10.74,"Valid",7.5958333333333341,"","",6.62,3.4770833333333333,10.74,7.5958333333333341,10.74,7.5958333333333341,6.62,3.4770833333333333]
[2023,6,1,17,45078.708333333292,3.97,"Valid",3.4162499999999998,9.82,"Valid",7.5770833333333334,"","",3.97,3.4162499999999998,9.82,7.5770833333333334,9.82,7.5770833333333334,3.97,3.4162499999999998]
[2023,6,1,18,45078.749999999956,1.38,"Valid",3.2837499999999995,11.56,"Valid",7.519166666666667,"","",1.38,3.2837499999999995,11.56,7.519166666666667,11.56,7.519166666666667,1.38,3.2837499999999995]
[2023,6,1,19,45078.791666666621,4.4400000000000004,"Valid",3.2095833333333328,10.1,"Valid",7.0195833333333324,"","",4.4400000000000004,3.2095833333333328,10.1,7.0195833333333324,10.1,7.0195833333333324,4.4400000000000004,3.2095833333333328]
[2023,6,1,20,45078.833333333285,4.5,"Valid",3.231666666666666,10.65,"Valid",7.0137500000000008,"","",4.5,3.231666666666666,10.65,7.0137500000000008,10.65,7.0137500000000008,4.5,3.231666666666666]
[2023,6,1,21,45078.874999999949,5.33,"Valid",3.2504166666666667,8.1,"Valid",6.6433333333333335,"","",5.33,3.2504166666666667,8.1,6.6433333333333335,8.1,6.6433333333333335,5.33,3.2504166666666667]
[2023,6,1,22,45078.916666666613,4.67,"Valid",3.2870833333333334,7.61,"Valid",6.6791666666666671,"","",4.67,3.2870833333333334,7.61,6.6791666666666671,7.61,6.6791666666666671,4.67,3.2870833333333334]
[2023,6,{"$f":"C24","v":1},23,45078.958333333278,3.69,"Valid",3.3208333333333329,6.45,"Valid",6.7216666666666667,"","",3.69,3.3208333333333329,6.45,6.7216666666666667,6.45,6.7216666666666667,3.69,3.3208333333333329]
[2023,6,{"$f":"C2+1","v":2},0,45078.999999999942,1.95,"Valid",3.3841666666666659,4.45,"Valid",6.7820833333333326,"","",1.95,3.3841666666666659,4.45,6.7820833333333326,4.45,6.7820833333333326,1.95,3.3841666666666659]
[2023,6,{"$f":"C3+1","v":2},1,45079.041666666606,4.4800000000000004,"Valid",3.5629166666666663,6.39,"Valid",6.9333333333333309,"","",4.4800000000000004,3.5629166666666663,6.39,6.9333333333333309,6.39,6.9333333333333309,4.4800000000000004,3.5629166666666663]
[2023,6,2,2,45079.08333333327,1.52,"Valid",3.6199999999999997,3.74,"Valid",6.9966666666666653,"","",1.52,3.6199999999999997,3.74,6.9966666666666653,3.74,6.9966666666666653,1.52,3.6199999999999997]
[2023,6,2,3,45079.124999999935,3.27,"Valid",3.6029166666666668,5.19,"Valid",6.996249999999999,"","",3.27,3.6029166666666668,5.19,6.996249999999999,5.19,6.996249999999999,3.27,3.6029166666666668]
[2023,6,2,4,45079.166666666599,-0.91,"Valid",3.48,0.53,"Valid",6.8508333333333331,"","",-0.91,3.48,0.53,6.8508333333333331,0.53,6.8508333333333331,-0.91,3.48]
[2023,6,2,5,45079.208333333263,-0.16,"Valid",3.3412500000000001,1.41,"Valid",6.6887499999999989,"","",-0.16,3.3412500000000001,1.41,6.6887499999999989,1.41,6.6887499999999989,-0.16,3.3412500000000001]
[2023,6,2,6,45079.249999999927,-1.44,"Valid",3.1483333333333334,0.12,"Valid",6.5008333333333326,"","",-1.44,3.1483333333333334,0.12,6.5008333333333326,0.12,6.5008333333333326,-1.44,3.1483333333333334]
[2023,6,2,7,45079.291666666591,0.68,"Valid",3.0770833333333338,2.59,"Valid",6.4570833333333333,"","",0.68,3.0770833333333338,2.59,6.4570833333333333,2.59,6.4570833333333333,0.68,3.0770833333333338]
[2023,6,2,8,45079.333333333256,-0.06,"Valid",2.8395833333333336,1.77,"Valid",6.205000000000001,"","",-0.06,2.8395833333333336,1.77,6.205000000000001,1.77,6.205000000000001,-0.06,2.8395833333333336]
[2023,6,2,9,45079.37499999992,2.4500000000000002,"Valid",2.7316666666666669,5.18,"Valid",6.1104166666666684,"","",2.4500000000000002,2.7316666666666669,5.18,6.1104166666666684,5.18,6.1104166666666684,2.4500000000000002,2.7316666666666669]
[2023,6,2,10,45079.416666666584,2.93,"Valid",2.7887500000000007,6.54,"Valid",6.2350000000000003,"","",2.93,2.7887500000000007,6.54,6.2350000000000003,6.54,6.2350000000000003,2.93,2.7887500000000007]
[2023,6,2,11,45079.458333333248,1.7,"Valid",2.8137500000000006,7.22,"Valid",6.3050000000000006,"","",1.7,2.8137500000000006,7.22,6.3050000000000006,7.22,6.3050000000000006,1.7,2.8137500000000006]
[2023,6,2,12,45079.499999999913,6.12,"Valid",2.8420833333333344,24.3,"Valid",6.9229166666666666,"","",6.12,2.8420833333333344,24.3,6.9229166666666666,24.3,6.9229166666666666,6.12,2.8420833333333344]
[2023,6,2,13,45079.541666666577,4.91,"Valid",2.796250000000001,17.260000000000002,"Valid",7.2262500000000012,"","",4.91,2.796250000000001,17.260000000000002,7.2262500000000012,17.260000000000002,7.2262500000000012,4.91,2.796250000000001]
[2023,6,2,14,45079.583333333241,7.95,"Valid",3.1033333333333348,14.56,"Valid",7.6887500000000015,"","",7.95,3.1033333333333348,14.56,7.6887500000000015,14.56,7.6887500000000015,7.95,3.1033333333333348]
[2023,6,2,15,45079.624999999905,6.31,"Valid",3.1791666666666676,13.01,"Valid",7.887083333333333,"","",6.31,3.1791666666666676,13.01,7.887083333333333,13.01,7.887083333333333,6.31,3.1791666666666676]
[2023,6,2,16,45079.66666666657,7.01,"Valid",3.1954166666666679,12.84,"Valid",7.9745833333333325,"","",7.01,3.1954166666666679,12.84,7.9745833333333325,12.84,7.9745833333333325,7.01,3.1954166666666679]
[2023,6,2,17,45079.708333333234,7.45,"Valid",3.3404166666666679,14.32,"Valid",8.1620833333333334,"","",7.45,3.3404166666666679,14.32,8.1620833333333334,14.32,8.1620833333333334,7.45,3.3404166666666679]
[2023,6,2,18,45079.749999999898,5.7,"Valid",3.5204166666666676,21.5,"Valid",8.5762499999999999,"","",5.7,3.5204166666666676,21.5,8.5762499999999999,21.5,8.5762499999999999,5.7,3.5204166666666676]
[2023,6,2,19,45079.791666666562,4.59,"Valid",3.5266666666666673,11.26,"Valid",8.6245833333333319,"","",4.59,3.5266666666666673,11.26,8.6245833333333319,11.26,8.6245833333333319,4.59,3.5266666666666673]
[2023,6,2,20,45079.833333333227,2.19,"Valid",3.4304166666666664,5.7,"Valid",8.418333333333333,"","",2.19,{"$f":"IF(G46=\"Valid\", H46, NA())","v":3.4304166666666664},{"$f":"IF(J46=\"Valid\", I46, NA())","v":5.7},8.418333333333333,5.7,8.418333333333333,2.19,3.4304166666666664]
[2023,6,2,21,45079.874999999891,7.83,"Valid",3.5345833333333334,22.79,"Valid",9.0304166666666656,"","",7.83,3.5345833333333334,22.79,9.0304166666666656,22.79,9.0304166666666656,7.83,3.5345833333333334]
[2023,6,2,22,45079.916666666555,6.11,"Valid",3.594583333333333,11.88,"Valid",9.2083333333333321,"","",6.11,3.594583333333333,11.88,9.2083333333333321,11.88,9.2083333333333321,6.11,3.594583333333333]
[2023,6,2,23,45079.958333333219,6.61,"Valid",3.7162500000000001,13.21,"Valid",9.49,"","",6.61,3.7162500000000001,13.21,9.49,13.21,9.49,6.61,3.7162500000000001]
[2023,6,3,0,45079.999999999884,6.74,"Valid",3.9158333333333331,9.8699999999999992,"Valid",9.7158333333333342,"","",6.74,3.9158333333333331,9.8699999999999992,9.7158333333333342,9.8699999999999992,9.7158333333333342,6.74,3.9158333333333331]
[2023,6,3,1,45080.041666666548,1.97,"Valid",3.8112499999999994,3.78,"Valid",9.6070833333333336,"","",1.97,3.8112499999999994,3.78,9.6070833333333336,3.78,9.6070833333333336,1.97,3.8112499999999994]
[2023,6,3,2,45080.083333333212,3.52,"Valid",3.8945833333333328,5.5,"Valid",9.680416666666666,"","",3.52,3.8945833333333328,5.5,9.680416666666666,5.5,9.680416666666666,3.52,3.8945833333333328]
[2023,6,3,3,45080.124999999876,3.63,"Valid",3.9095833333333325,5.8,"Valid",9.7058333333333326,"","",3.63,3.9095833333333325,5.8,9.7058333333333326,5.8,9.7058333333333326,3.63,3.9095833333333325]
[2023,6,3,4,45080.166666666541,6.26,"Valid",4.208333333333333,9.08,"Valid",10.062083333333334,"","",6.26,4.208333333333333,9.08,10.062083333333334,9.08,10.062083333333334,6.26,4.208333333333333]
[2023,6,3,5,45080.208333333205,4.96,"Valid",4.421666666666666,6.87,"Valid",10.289583333333335,"","",4.96,4.421666666666666,6.87,10.289583333333335,6.87,10.289583333333335,4.96,4.421666666666666]
[2023,6,3,6,45080.249999999869,1.78,"Valid",4.5558333333333332,3.48,"Valid",10.429583333333333,"","",1.78,4.5558333333333332,3.48,10.429583333333333,3.48,10.429583333333333,1.78,4.5558333333333332]
[2023,6,3,7,45080.291666666533,5.75,"Valid",4.7670833333333329,7.62,"Valid",10.639166666666666,"","",5.75,4.7670833333333329,7.62,10.639166666666666,7.62,10.639166666666666,5.75,4.7670833333333329]
[2023,6,3,8,45080.333333333198,8.2200000000000006,"Valid",5.1120833333333326,11.96,"Valid",11.063750000000001,"","",8.2200000000000006,5.1120833333333326,11.96,11.063750000000001,11.96,11.063750000000001,8.2200000000000006,5.1120833333333326]
[2023,6,3,9,45080.374999999862,8.43,"Valid",5.3612499999999992,13.25,"Valid",11.4,"","",8.43,5.3612499999999992,13.25,11.4,13.25,11.4,8.43,5.3612499999999992]
[2023,6,3,10,45080.416666666526,2.46,"Valid",5.3416666666666659,6.62,"Valid",11.403333333333336,"","",2.46,5.3416666666666659,6.62,11.403333333333336,6.62,11.403333333333336,2.46,5.3416666666666659]
[2023,6,3,11,45080.45833333319,4.6399999999999997,"Valid",5.4641666666666664,8.81,"Valid",11.469583333333334,"","",4.6399999999999997,5.4641666666666664,8.81,11.469583333333334,8.81,11.469583333333334,4.6399999999999997,5.4641666666666664]
[2023,6,3,12,45080.499999999854,2.79,"Valid",5.3254166666666665,5.79,"Valid",10.698333333333336,"","",2.79,5.3254166666666665,5.79,10.698333333333336,5.79,10.698333333333336,2.79,5.3254166666666665]
[2023,6,3,13,45080.541666666519,7.08,"Valid",5.4158333333333326,11.03,"Valid",10.438750000000001,"","",7.08,5.4158333333333326,11.03,10.438750000000001,11.03,10.438750000000001,7.08,5.4158333333333326]
[2023,6,3,14,45080.583333333183,6.79,"Valid",5.3674999999999997,12.38,"Valid",10.347916666666668,"","",6.79,5.3674999999999997,12.38,10.347916666666668,12.38,10.347916666666668,6.79,5.3674999999999997]
[2023,6,3,15,45080.624999999847,7.03,"Valid",5.3975,11.43,"Valid",10.282083333333334,"","",7.03,5.3975,11.43,10.282083333333334,11.43,10.282083333333334,7.03,5.3975]
[2023,6,3,16,45080.666666666511,3.69,"Valid",5.2591666666666672,7.71,"Valid",10.068333333333333,"","",{"$f":"IF(G66=\"Valid\", F66, NA())","v":3.69},{"$f":"IF(G66=\"Valid\", H66, NA())","v":5.2591666666666672},{"$f":"IF(J66=\"Valid\", I66, NA())","v":7.71},{"$f":"IF(J66=\"Valid\", K66, NA())","v":10.068333333333333},7.71,10.068333333333333,3.69,5.2591666666666672]
[2023,6,3,17,45080.708333333176,6.27,"Valid",5.2100000000000009,9.61,"Valid",9.8720833333333342,"","",6.27,5.2100000000000009,9.61,9.8720833333333342,9.61,9.8720833333333342,6.27,5.2100000000000009]
[{"$f":"A67","v":2023},6,3,{"$f":"IF(D67=23,0,D67+1)","v":18},{"$f":"E67+0.0416666666666666","v":45080.74999999984},7.69,"Valid",5.2929166666666667,24.64,"Valid",10.002916666666666,"","",7.69,5.2929166666666667,24.64,10.002916666666666,24.64,10.002916666666666,7.69,5.2929166666666667]
[2023,6,3,19,45080.791666666504,6.46,"Valid",5.3708333333333336,16.97,"Valid",10.240833333333333,"","",6.46,5.3708333333333336,16.97,10.240833333333333,16.97,10.240833333333333,6.46,5.3708333333333336]
[2023,6,3,20,45080.833333333168,4.24,"Valid",5.4562499999999998,9.16,"Valid",10.385,"","",4.24,5.4562499999999998,9.16,10.385,9.16,10.385,4.24,5.4562499999999998]
[2023,6,3,21,45080.874999999833,6.2,"Valid",5.3883333333333328,9.9499999999999993,"Valid",9.85,"","",6.2,5.3883333333333328,9.9499999999999993,9.85,9.9499999999999993,9.85,6.2,5.3883333333333328]
[2023,6,3,22,45080.916666666497,7.75,"Valid",5.4566666666666661,11.57,"Valid",9.8370833333333323,"","",7.75,5.4566666666666661,11.57,9.8370833333333323,11.57,9.8370833333333323,7.75,5.4566666666666661]
[2023,6,3,23,45080.958333333161,8.07,"Valid",5.5174999999999992,11.3,"Valid",9.7575000000000003,"","",8.07,5.5174999999999992,11.3,9.7575000000000003,11.3,9.7575000000000003,8.07,5.5174999999999992]
[2023,6,4,0,45080.999999999825,8.0299999999999994,"Valid",5.5712499999999991,11.57,"Valid",9.8283333333333331,"","",8.0299999999999994,5.5712499999999991,11.57,9.8283333333333331,11.57,9.8283333333333331,8.0299999999999994,5.5712499999999991]
[2023,6,4,1,45081.04166666649,6.97,"Valid",5.7795833333333322,14.66,"Valid",10.281666666666665,"","",6.97,5.7795833333333322,14.66,10.281666666666665,14.66,10.281666666666665,6.97,5.7795833333333322]
[2023,6,4,2,45081.083333333154,4.13,"Valid",5.8049999999999988,7.49,"Valid",10.364583333333332,"","",4.13,5.8049999999999988,7.49,10.364583333333332,7.49,10.364583333333332,4.13,5.8049999999999988]
[2023,6,4,3,45081.124999999818,2.79,"Valid",5.7699999999999987,5.78,"Valid",10.363749999999998,"","",2.79,5.7699999999999987,5.78,10.363749999999998,5.78,10.363749999999998,2.79,5.7699999999999987]
[2023,6,4,4,45081.166666666482,5.29,"Valid",5.7295833333333315,7.77,"Valid",10.309166666666666,"","",5.29,5.7295833333333315,7.77,10.309166666666666,7.77,10.309166666666666,5.29,5.7295833333333315]
[2023,6,4,5,45081.208333333147,7.15,"Valid",5.8208333333333329,10.16,"Valid",10.446249999999999,"","",7.15,5.8208333333333329,10.16,10.446249999999999,10.16,10.446249999999999,7.15,5.8208333333333329]
[2023,6,4,6,45081.249999999811,7.34,"Valid",6.0524999999999993,16.45,"Valid",10.986666666666665,"","",7.34,6.0524999999999993,16.45,10.986666666666665,16.45,10.986666666666665,7.34,6.0524999999999993]
{"$rows_left_out":642}
{"sheet":"Raw data_format","index":4,"n_rows":8,"n_cols":6,"rows_kept":8,"cut":false,"hidden":false,"merged":[]}
["Parameter","Format","Comment","Units of measure","Minimum","Maximum"]
["Year","yyyy","4 integer format","Not applicable",2015,"Until reporting ceases"]
["Month","mm","2 integer format","Not applicable",1,12]
["Day","dd","2 integer format","Not applicable",1,31]
["Hour","hh","2 integer format","Not applicable",0,23]
["PM10",0,"1 decimal place resolution","µg/m3","Negative","Instrument specific"]
["PM2.5",0,"2 decimal place resolution","µg/m3","Negative","Instrument specific"]
["Status","Text","7 character format","Not applicable","Valid","Invalid"]

{"sheet":"Sheet1","index":7,"n_rows":0,"n_cols":0,"rows_kept":0,"cut":false,"hidden":false,"merged":[]}