{"text_format":"1","workbook":"xlsx","n_sheets":8,"sheets":["Instructions","Meta data_sheet","Meta data_lookup","Raw data_sheet","Raw data_format","24hr_PM10_chart","24hr_PM2.5_chart","Sheet1"],"not_rendered":{"charts":4,"images":0,"macros":1,"external_links":0,"defined_names":10,"comments":0,"pivot_tables":0},"unopened":[{"sheet":"24hr_PM10_chart","index":5,"reason":"not_a_worksheet"},{"sheet":"24hr_PM2.5_chart","index":6,"reason":"not_a_worksheet"}],"bounds":{"document_bytes":16777216,"sheet_cells":100000,"rows_first":2000,"rows_last":500,"rows_between":2000,"halvings":0,"cell_chars":16384,"cell_head_chars":4096},"cells_cut":0,"cells_raw":0,"read":"whole","date_system":"1900"}

{"sheet":"Instructions","index":0,"n_rows":0,"n_cols":0,"rows_kept":0,"cut":false,"hidden":false,"merged":[]}

{"sheet":"Meta data_sheet","index":1,"n_rows":17,"n_cols":5,"rows_kept":17,"cut":false,"hidden":false,"merged":[[18,0,18,1],[16,0,16,1]]}
["Ambient Monitoring Station","Details",null,"Ambient Monitoring Results","Details"]
["Location","Maules Creek",null,"PM2.5 monitoring start (dd/mm/yyyy hh:mm)","2020-01-01"]
["Easting",{"$f":"VLOOKUP($B$2,'Meta data_lookup'!$A$2:$D$5,2,FALSE)","v":225302},null,"PM2.5 monitoring end","2020-02-01"]
["Northing",{"$f":"VLOOKUP($B$2,'Meta data_lookup'!$A$2:$D$5,3,FALSE)","v":6623037},null,"PM2.5 monitoring period (h)",{"$f":"(E3-E2)*24","v":744}]
["Site elevation (m)",{"$f":"VLOOKUP($B$2,'Meta data_lookup'!$A$2:$D$5,4,FALSE)","v":"ND"},null,"Number of valid PM2.5 results",{"$f":"COUNTIF('Raw data_sheet'!G2:G745,\"Valid\")","v":709}]
["Description of surrounding land use","Agriculture/Mining",null,"Proportion of valid PM2.5 results (%)",{"$f":"E5/E4","v":0.95295698924731187}]
["Typical sources impacting on the site","Agriculture/Mining/Unsealed Roads",null,"PM10 monitoring start (dd/mm/yyyy hh:mm)","2020-01-01"]
["Site compliance with AS/NZS 3580.1.1:2007","Yes",null,"PM10 monitoring end","2020-02-01"]
["PM2.5 method compliance with AS/NZS 3580.9.13:2013\n","Yes",null,"PM10 monitoring period (h)",{"$f":"(E8-E7)*24","v":744}]
["PM2.5 instrument make","Thermo Scientific",null,"Number of valid PM10 results",{"$f":"COUNTIF('Raw data_sheet'!J2:J745,\"Valid\")","v":709}]
["PM2.5 instrument model","1405DF",null,"Proportion of valid PM10 results (%)",{"$f":"E10/E9","v":0.95295698924731187}]
["PM2.5 instrument intake height (m)",3.5]
["PM10 method compliance with AS 3580.9.8-2008\n","No*"]
["PM10 instrument make","Thermo Scientific"]
["PM10 instrument model","1405DF"]
["PM10 instrument intake height (m)",3.5]
["*The 1405DF TEOM used at this site measures PM10 indirectly rather than directly. The unit does however meet the intent of AS 3580.9.8-2008, and this method has been accredited by the USEPA. It is considered scientifically robust and is used extensively throughout NSW with EPA's knowledge and informal acceptance."]

{"sheet":"Meta data_lookup","index":2,"n_rows":5,"n_cols":4,"rows_kept":5,"cut":false,"hidden":false,"merged":[]}
["Location","Easting","Northing","Site elevation (m)"]
["Maules Creek",225302,6623037,"ND"]
["Breeza",237993,6542606,"ND"]
["Will-gai",231804,6596392,"ND"]
["Werris Creek",276783,6528734,"ND"]

{"sheet":"Raw data_sheet","index":3,"n_rows":745,"n_cols":21,"rows_kept":745,"cut":false,"hidden":false,"merged":[]}
["Year","Month","Day","Hour","Date and time","PM2.5_hourly","PM2.5_Data_Status","PM2.5_24hr_rolling_average","PM10_hourly","PM10_Data_Status","PM10_24hr_rolling_average","Cause of data invalidity, if applicable","Detailed comments","PM2.5_hourly_valid_plot","PM2.5_24hr_rolling_ave_valid_plot","PM10_hourly_valid_plot","PM10_24hr_rolling_ave_valid_plot","PM10_hourly_valid_plot_series","PM10_24hr_rolling_average_valid_plot_series","PM2.5_hourly_valid_plot_series","PM2.5_24hr_rolling_average_valid_plot_series"]
[2020,1,1,0,{"$f":"DATE(A2,B2,C2)+TIME(D2,0,0)","v":43831},13.39,"Valid",9.7899999999999991,25.42,"Valid",22.16,null,null,{"$f":"IF(G2=\"Valid\", F2, NA())","v":13.39},{"$f":"IF(G2=\"Valid\", H2, NA())","v":9.7899999999999991},{"$f":"IF(J2=\"Valid\", I2, NA())","v":25.42},{"$f":"IF(J2=\"Valid\", K2, NA())","v":22.16},25.42,22.16,13.39,9.7899999999999991]
[{"$f":"A2","v":2020},{"$f":"B2","v":1},{"$f":"C2","v":1},{"$f":"IF(D2=23,0,D2+1)","v":1},{"$f":"E2+0.0416666666666666","v":43831.041666666664},17.13,"Valid",10.24,26.41,"Valid",22.33,null,null,17.13,10.24,26.41,22.33,26.41,22.33,17.13,10.24]
[{"$f":"A3","v":2020},{"$f":"B3","v":1},1,{"$f":"IF(D3=23,0,D3+1)","v":2},{"$f":"E3+0.0416666666666666","v":43831.083333333328},14.22,"Valid",10.52,24.21,"Valid",22.48,null,null,14.22,10.52,24.21,22.48,24.21,22.48,14.22,10.52]
[2020,1,1,3,43831.124999999993,11.36,"Valid",10.66,20.22,"Valid",22.63,null,null,11.36,10.66,20.22,22.63,20.22,22.63,11.36,10.66]
[2020,1,1,4,43831.166666666657,5.82,"Valid",10.68,14.58,"Valid",22.59,null,null,5.82,10.68,14.58,22.59,14.58,22.59,5.82,10.68]
[2020,1,1,5,43831.208333333321,4.62,"Valid",10.66,11.78,"Valid",22.53,null,null,4.62,10.66,11.78,22.53,11.78,22.53,4.62,10.66]
[2020,1,1,6,43831.249999999985,8.74,"Valid",10.88,14.64,"Valid",22.67,null,null,8.74,10.88,14.64,22.67,14.64,22.67,8.74,10.88]
[2020,1,1,7,43831.29166666665,6.41,"Valid",10.92,19.22,"Valid",22.83,null,null,6.41,10.92,19.22,22.83,19.22,22.83,6.41,10.92]
[2020,1,1,8,43831.333333333314,6.13,"Valid",11.04,17.86,"Valid",22.91,null,null,6.13,11.04,17.86,22.91,17.86,22.91,6.13,11.04]
[2020,1,1,9,43831.374999999978,7.9,"Valid",11.01,18.71,"Valid",22.96,null,null,7.9,11.01,18.71,22.96,18.71,22.96,7.9,11.01]
[2020,1,1,10,43831.416666666642,9.49,"Valid",11.15,30.7,"Valid",23.58,null,null,9.49,11.15,30.7,23.58,30.7,23.58,9.49,11.15]
[2020,1,1,11,43831.458333333307,10.89,"Valid",11.12,19.63,"Valid",22.99,null,null,10.89,11.12,19.63,22.99,19.63,22.99,10.89,11.12]
[2020,1,1,12,43831.499999999971,11.97,"Valid",11.24,29.1,"Valid",23.31,null,null,11.97,11.24,29.1,23.31,29.1,23.31,11.97,11.24]
[2020,1,1,13,43831.541666666635,10.57,"Valid",11.3,26.05,"Valid",23.14,null,null,10.57,11.3,26.05,23.14,26.05,23.14,10.57,11.3]
[2020,1,1,14,43831.583333333299,10.74,"Valid",11.23,20.85,"Valid",22.67,null,null,10.74,11.23,20.85,22.67,20.85,22.67,10.74,11.23]
[2020,1,1,15,43831.624999999964,12.88,"Valid",11.44,22.04,"Valid",22.32,null,null,12.88,11.44,22.04,22.32,22.04,22.32,12.88,11.44]
[2020,1,1,16,43831.666666666628,21.25,"Valid",11.81,29.96,"Valid",22.15,null,null,21.25,11.81,29.96,22.15,29.96,22.15,21.25,11.81]
[2020,1,1,17,43831.708333333292,13.09,"Valid",11.92,23.06,"Valid",22.23,null,null,13.09,11.92,23.06,22.23,23.06,22.23,13.09,11.92]
[2020,1,1,18,43831.749999999956,22.63,"Valid",12.37,31.27,"Valid",22.7,null,null,22.63,12.37,31.27,22.7,31.27,22.7,22.63,12.37]
[2020,1,1,19,43831.791666666621,20.65,"Valid",12.35,29.16,"Valid",22.74,null,null,20.65,12.35,29.16,22.74,29.16,22.74,20.65,12.35]
[2020,1,1,20,43831.833333333285,15.59,"Valid",12.36,24.51,"Valid",22.79,null,null,15.59,12.36,24.51,22.79,24.51,22.79,15.59,12.36]
[2020,1,1,21,43831.874999999949,16.38,"Valid",12.52,24.41,"Valid",22.98,null,null,16.38,12.52,24.41,22.98,24.41,22.98,16.38,12.52]
[2020,1,1,22,43831.916666666613,16.510000000000002,"Valid",12.61,25.16,"Valid",23.07,null,null,16.510000000000002,12.61,25.16,23.07,25.16,23.07,16.510000000000002,12.61]
[2020,{"$f":"B24","v":1},{"$f":"C24","v":1},23,43831.958333333278,15.06,"Valid",12.64,23.61,"Valid",23.02,null,null,15.06,12.64,23.61,23.02,23.61,23.02,15.06,12.64]
[2020,{"$f":"B25","v":1},{"$f":"C2+1","v":2},0,43831.999999999942,15.94,"Valid",12.75,28.39,"Valid",23.15,null,null,15.94,12.75,28.39,23.15,28.39,23.15,15.94,12.75]
[2020,{"$f":"B26","v":1},{"$f":"C3+1","v":2},1,43832.041666666606,19.12,"Valid",12.83,39.04,"Valid",23.67,null,null,19.12,12.83,39.04,23.67,39.04,23.67,19.12,12.83]
[2020,1,2,2,43832.08333333327,18.190000000000001,"Valid",13,35.79,"Valid",24.16,null,null,18.190000000000001,13,35.79,24.16,35.79,24.16,18.190000000000001,13]
[2020,1,2,3,43832.124999999935,21.39,"Valid",13.42,30,"Valid",24.56,null,null,21.39,13.42,30,24.56,30,24.56,21.39,13.42]
[2020,1,2,4,43832.166666666599,18.43,"Valid",13.94,27.67,"Valid",25.11,null,null,18.43,13.94,27.67,25.11,27.67,25.11,18.43,13.94]
[2020,1,2,5,43832.208333333263,18.170000000000002,"Valid",14.51,28.35,"Valid",25.8,null,null,18.170000000000002,14.51,28.35,25.8,28.35,25.8,18.170000000000002,14.51]
[2020,1,2,6,43832.249999999927,16.54,"Valid",14.83,26.13,"Valid",26.28,null,null,16.54,14.83,26.13,26.28,26.13,26.28,16.54,14.83]
[2020,1,2,7,43832.291666666591,16.52,"Valid",15.25,36.549999999999997,"Valid",27,null,null,16.52,15.25,36.549999999999997,27,36.549999999999997,27,16.52,15.25]
[2020,1,2,8,43832.333333333256,22.81,"Valid",15.95,44.78,"Valid",28.12,null,null,22.81,15.95,44.78,28.12,44.78,28.12,22.81,15.95]
[2020,1,2,9,43832.37499999992,26.83,"Valid",16.739999999999998,47.53,"Valid",29.32,null,null,26.83,16.739999999999998,47.53,29.32,47.53,29.32,26.83,16.739999999999998]
[2020,1,2,10,43832.416666666584,20.8,"Valid",17.21,39.56,"Valid",29.69,null,null,20.8,17.21,39.56,29.69,39.56,29.69,20.8,17.21]
[2020,1,2,11,43832.458333333248,23.91,"Valid",17.75,36.36,"Valid",30.39,null,null,23.91,17.75,36.36,30.39,36.36,30.39,23.91,17.75]
[2020,1,2,12,43832.499999999913,18.25,"Valid",18.010000000000002,29.49,"Valid",30.41,null,null,18.25,18.010000000000002,29.49,30.41,29.49,30.41,18.25,18.010000000000002]
[2020,1,2,13,43832.541666666577,15.84,"Valid",18.23,25.31,"Valid",30.37,null,null,15.84,18.23,25.31,30.37,25.31,30.37,15.84,18.23]
[2020,1,2,14,43832.583333333241,15.91,"Valid",18.45,25.39,"Valid",30.56,null,null,15.91,18.45,25.39,30.56,25.39,30.56,15.91,18.45]
[2020,1,2,15,43832.624999999905,20.170000000000002,"Valid",18.75,31.86,"Valid",30.97,null,null,20.170000000000002,18.75,31.86,30.97,31.86,30.97,20.170000000000002,18.75]
[2020,1,2,16,43832.66666666657,12.56,"Valid",18.39,30.53,"Valid",31,null,null,12.56,18.39,30.53,31,30.53,31,12.56,18.39]
[2020,1,2,17,43832.708333333234,17.75,"Valid",18.579999999999998,35.229999999999997,"Valid",31.5,null,null,17.75,18.579999999999998,35.229999999999997,31.5,35.229999999999997,31.5,17.75,18.579999999999998]
[2020,1,2,18,43832.749999999898,17.79,"Valid",18.38,34.31,"Valid",31.63,null,null,17.79,18.38,34.31,31.63,34.31,31.63,17.79,18.38]
[2020,1,2,19,43832.791666666562,23.85,"Valid",18.510000000000002,103.87,"Valid",34.74,null,null,23.85,18.510000000000002,103.87,34.74,103.87,34.74,23.85,18.510000000000002]
[2020,1,2,20,43832.833333333227,{"$f":"NA()","v":{"$error":"#N/A"}},"Invalid",{"$f":"NA()","v":{"$error":"#N/A"}},{"$f":"NA()","v":{"$error":"#N/A"}},"Invalid",{"$f":"NA()","v":{"$error":"#N/A"}},"Power Failure","Power outage",{"$error":"#N/A"},{"$f":"IF(G46=\"Valid\", H46, NA())","v":{"$error":"#N/A"}},{"$f":"IF(J46=\"Valid\", I46, NA())","v":{"$error":"#N/A"}},{"$error":"#N/A"}]
[2020,1,2,21,43832.874999999891,{"$f":"NA()","v":{"$error":"#N/A"}},"Invalid",{"$f":"NA()","v":{"$error":"#N/A"}},{"$f":"NA()","v":{"$error":"#N/A"}},"Invalid",{"$f":"NA()","v":{"$error":"#N/A"}},"Power Failure","Power outage/system reset",{"$error":"#N/A"},{"$error":"#N/A"},{"$error":"#N/A"},{"$error":"#N/A"}]
[2020,1,2,22,43832.916666666555,{"$f":"NA()","v":{"$error":"#N/A"}},"Invalid",{"$f":"NA()","v":{"$error":"#N/A"}},{"$f":"NA()","v":{"$error":"#N/A"}},"Invalid",{"$f":"NA()","v":{"$error":"#N/A"}},"Power Failure","Power outage/system reset",{"$error":"#N/A"},{"$error":"#N/A"},{"$error":"#N/A"},{"$error":"#N/A"}]
[2020,1,2,23,43832.958333333219,{"$f":"NA()","v":{"$error":"#N/A"}},"Invalid",{"$f":"NA()","v":{"$error":"#N/A"}},{"$f":"NA()","v":{"$error":"#N/A"}},"Invalid",{"$f":"NA()","v":{"$error":"#N/A"}},"Power Failure","Power outage/system reset",{"$error":"#N/A"},{"$error":"#N/A"},{"$error":"#N/A"},{"$error":"#N/A"}]
[2020,1,3,0,43832.999999999884,{"$f":"NA()","v":{"$error":"#N/A"}},"Invalid",{"$f":"NA()","v":{"$error":"#N/A"}},{"$f":"NA()","v":{"$error":"#N/A"}},"Invalid",{"$f":"NA()","v":{"$error":"#N/A"}},"Power Failure","Power outage/system reset",{"$error":"#N/A"},{"$error":"#N/A"},{"$error":"#N/A"},{"$error":"#N/A"}]
[2020,1,3,1,43833.041666666548,4.49,"Valid",18.43,9.64,"Valid",35.700000000000003,null,null,4.49,18.43,9.64,35.700000000000003,9.64,35.700000000000003,4.49,18.43]
[2020,1,3,2,43833.083333333212,9.59,"Valid",17.98,29.14,"Valid",35.35,null,null,9.59,17.98,29.14,35.35,29.14,35.35,9.59,17.98]
[2020,1,3,3,43833.124999999876,12.32,"Valid",17.5,40.17,"Valid",35.89,null,null,12.32,17.5,40.17,35.89,40.17,35.89,12.32,17.5]
[2020,1,3,4,43833.166666666541,8.93,"Valid",17,38.19,"Valid",36.44,null,null,8.93,17,38.19,36.44,38.19,36.44,8.93,17]
[2020,1,3,5,43833.208333333205,9.18,"Valid",16.53,41.67,"Valid",37.14,null,null,9.18,16.53,41.67,37.14,41.67,37.14,9.18,16.53]
[2020,1,3,6,43833.249999999869,9.09,"Valid",16.14,33.6,"Valid",37.54,null,null,9.09,16.14,33.6,37.54,33.6,37.54,9.09,16.14]
[2020,1,3,7,43833.291666666533,8.16,"Valid",15.7,38.130000000000003,"Valid",37.619999999999997,null,null,8.16,15.7,38.130000000000003,37.619999999999997,38.130000000000003,37.619999999999997,8.16,15.7]
[2020,1,3,8,43833.333333333198,10.14,"Valid",15.03,36.07,"Valid",37.159999999999997,null,null,10.14,15.03,36.07,37.159999999999997,36.07,37.159999999999997,10.14,15.03]
[2020,1,3,9,43833.374999999862,9.61,"Valid",14.12,36.590000000000003,"Valid",36.58,null,null,9.61,14.12,36.590000000000003,36.58,36.590000000000003,36.58,9.61,14.12]
[2020,1,3,10,43833.416666666526,11.28,"Valid",13.62,27.89,"Valid",35.97,null,null,11.28,13.62,27.89,35.97,27.89,35.97,11.28,13.62]
[2020,1,3,11,43833.45833333319,12.92,"Valid",13.04,33.97,"Valid",35.840000000000003,null,null,12.92,13.04,33.97,35.840000000000003,33.97,35.840000000000003,12.92,13.04]
[2020,1,3,12,43833.499999999854,15.1,"Valid",12.88,34.03,"Valid",36.08,null,null,15.1,12.88,34.03,36.08,34.03,36.08,15.1,12.88]
[2020,1,3,13,43833.541666666519,10.29,"Valid",12.59,21.86,"Valid",35.9,null,null,10.29,12.59,21.86,35.9,21.86,35.9,10.29,12.59]
[2020,1,3,14,43833.583333333183,13.06,"Valid",12.44,20.84,"Valid",35.659999999999997,null,null,13.06,12.44,20.84,35.659999999999997,20.84,35.659999999999997,13.06,12.44]
[2020,1,3,15,43833.624999999847,10.59,"Valid",11.93,17.72,"Valid",34.92,null,null,10.59,11.93,17.72,34.92,17.72,34.92,10.59,11.93]
[2020,1,3,16,43833.666666666511,17.32,"Valid",12.18,23.52,"Valid",34.549999999999997,null,null,{"$f":"IF(G66=\"Valid\", F66, NA())","v":17.32},{"$f":"IF(G66=\"Valid\", H66, NA())","v":12.18},{"$f":"IF(J66=\"Valid\", I66, NA())","v":23.52},{"$f":"IF(J66=\"Valid\", K66, NA())","v":34.549999999999997},23.52,34.549999999999997,17.32,12.18]
[2020,1,3,17,43833.708333333176,13.41,"Valid",11.95,20.059999999999999,"Valid",33.75,null,null,13.41,11.95,20.059999999999999,33.75,20.059999999999999,33.75,13.41,11.95]
[{"$f":"A67","v":2020},1,3,{"$f":"IF(D67=23,0,D67+1)","v":18},{"$f":"E67+0.0416666666666666","v":43833.74999999984},10.17,"Valid",11.55,17.489999999999998,"Valid",32.869999999999997,null,null,10.17,11.55,17.489999999999998,32.869999999999997,17.489999999999998,32.869999999999997,10.17,11.55]
[2020,1,3,19,43833.791666666504,14.14,"Valid",11.04,21.75,"Valid",28.54,null,null,14.14,11.04,21.75,28.54,21.75,28.54,14.14,11.04]
[2020,1,3,20,43833.833333333168,11.56,"Valid",11.07,19.350000000000001,"Valid",28.08,null,null,11.56,11.07,19.350000000000001,28.08,19.350000000000001,28.08,11.56,11.07]
[2020,1,3,21,43833.874999999833,9.85,"Valid",11.01,18,"Valid",27.6,null,null,9.85,11.01,18,27.6,18,27.6,9.85,11.01]
[2020,1,3,22,43833.916666666497,8.1999999999999993,"Valid",10.88,14.03,"Valid",26.99,null,null,8.1999999999999993,10.88,14.03,26.99,14.03,26.99,8.1999999999999993,10.88]
[2020,1,3,23,43833.958333333161,12.3,"Valid",10.94,16.84,"Valid",26.55,null,null,12.3,10.94,16.84,26.55,16.84,26.55,12.3,10.94]
[2020,1,4,0,43833.999999999825,11.13,"Valid",10.95,17.41,"Valid",26.17,null,null,11.13,10.95,17.41,26.17,17.41,26.17,11.13,10.95]
[2020,1,4,1,43834.04166666649,9.52,"Valid",11.16,17.239999999999998,"Valid",26.48,null,null,9.52,11.16,17.239999999999998,26.48,17.239999999999998,26.48,9.52,11.16]
[2020,1,4,2,43834.083333333154,9.86,"Valid",11.17,18.25,"Valid",26.03,null,null,9.86,11.17,18.25,26.03,18.25,26.03,9.86,11.17]
[2020,1,4,3,43834.124999999818,18.72,"Valid",11.44,25.49,"Valid",25.42,null,null,18.72,11.44,25.49,25.42,25.49,25.42,18.72,11.44]
[2020,1,4,4,43834.166666666482,16.079999999999998,"Valid",11.74,24.42,"Valid",24.84,null,null,16.079999999999998,11.74,24.42,24.84,24.42,24.84,16.079999999999998,11.74]
[2020,1,4,5,43834.208333333147,17.55,"Valid",12.09,26.12,"Valid",24.19,null,null,17.55,12.09,26.12,24.19,26.12,24.19,17.55,12.09]
[2020,1,4,6,43834.249999999811,12.15,"Valid",12.21,19.75,"Valid",23.62,null,null,12.15,12.21,19.75,23.62,19.75,23.62,12.15,12.21]
[2020,1,4,7,43834.291666666475,10.32,"Valid",12.3,19.98,"Valid",22.86,null,null,10.32,12.3,19.98,22.86,19.98,22.86,10.32,12.3]
[2020,1,4,8,43834.333333333139,10.3,"Valid",12.31,21.81,"Valid",22.27,null,null,10.3,12.31,21.81,22.27,21.81,22.27,10.3,12.31]
[2020,1,4,9,43834.374999999804,11.55,"Valid",12.39,19.03,"Valid",21.54,null,null,11.55,12.39,19.03,21.54,19.03,21.54,11.55,12.39]
[2020,1,4,10,43834.416666666468,11.54,"Valid",12.4,26.09,"Valid",21.46,null,null,11.54,12.4,26.09,21.46,26.09,21.46,11.54,12.4]
[2020,1,4,11,43834.458333333132,11.58,"Valid",12.35,23.59,"Valid",21.03,null,null,11.58,12.35,23.59,21.03,23.59,21.03,11.58,12.35]
[2020,1,4,12,43834.499999999796,10.69,"Valid",12.16,19.46,"Valid",20.420000000000002,null,null,10.69,12.16,19.46,20.420000000000002,19.46,20.420000000000002,10.69,12.16]
[2020,1,4,13,43834.541666666461,15.36,"Valid",12.37,27.64,"Valid",20.66,null,null,15.36,12.37,27.64,20.66,27.64,20.66,15.36,12.37]
[2020,1,4,14,43834.583333333125,27,"Valid",12.95,38.53,"Valid",21.4,null,null,27,12.95,38.53,21.4,38.53,21.4,27,12.95]
[2020,1,4,15,43834.624999999789,14.25,"Valid",13.11,24.62,"Valid",21.69,null,null,14.25,13.11,24.62,21.69,24.62,21.69,14.25,13.11]
[2020,1,4,16,43834.666666666453,11.6,"Valid",12.87,21.44,"Valid",21.6,null,null,11.6,12.87,21.44,21.6,21.44,21.6,11.6,12.87]
[2020,{"$f":"B90","v":1},{"$f":"C67+1","v":4},17,43834.708333333117,15.44,"Valid",12.95,24.78,"Valid",21.8,null,null,15.44,12.95,24.78,21.8,24.78,21.8,15.44,12.95]
[2020,1,4,18,43834.749999999782,16.93,"Valid",13.23,25.23,"Valid",22.12,null,null,16.93,13.23,25.23,22.12,25.23,22.12,16.93,13.23]
[2020,1,4,19,43834.791666666446,10.34,"Valid",13.08,18.43,"Valid",21.98,null,null,10.34,13.08,18.43,21.98,18.43,21.98,10.34,13.08]
[2020,1,4,20,43834.83333333311,17.260000000000002,"Valid",13.31,26.21,"Valid",22.27,null,null,17.260000000000002,13.31,26.21,22.27,26.21,22.27,17.260000000000002,13.31]
[2020,1,4,21,43834.874999999774,16.02,"Valid",13.57,28.55,"Valid",22.71,null,null,16.02,13.57,28.55,22.71,28.55,22.71,16.02,13.57]
[2020,1,4,22,43834.916666666439,13.35,"Valid",13.79,28.85,"Valid",23.32,null,null,13.35,13.79,28.85,23.32,28.85,23.32,13.35,13.79]
[2020,1,4,23,43834.958333333103,11.62,"Valid",13.76,21.24,"Valid",23.51,null,null,11.62,13.76,21.24,23.51,21.24,23.51,11.62,13.76]
[2020,1,5,0,43834.999999999767,12.59,"Valid",13.82,21.1,"Valid",23.66,null,null,12.59,13.82,21.1,23.66,21.1,23.66,12.59,13.82]
[2020,1,5,1,43835.041666666431,11.76,"Valid",13.91,21.38,"Valid",23.83,null,null,11.76,13.91,21.38,23.83,21.38,23.83,11.76,13.91]
[2020,1,5,2,43835.083333333096,13.67,"Valid",14.07,21.46,"Valid",23.97,null,null,13.67,14.07,21.46,23.97,21.46,23.97,13.67,14.07]
[2020,1,5,3,43835.12499999976,10.18,"Valid",13.71,17.32,"Valid",23.63,null,null,10.18,13.71,17.32,23.63,17.32,23.63,10.18,13.71]
[2020,1,5,4,43835.166666666424,13.13,"Valid",13.59,19.829999999999998,"Valid",23.44,null,null,13.13,13.59,19.829999999999998,23.44,19.829999999999998,23.44,13.13,13.59]
[2020,1,5,5,43835.208333333088,13.07,"Valid",13.4,20.23,"Valid",23.19,null,null,13.07,13.4,20.23,23.19,20.23,23.19,13.07,13.4]
[2020,1,5,6,43835.249999999753,13.52,"Valid",13.46,20.58,"Valid",23.22,null,null,13.52,13.46,20.58,23.22,20.58,23.22,13.52,13.46]
[2020,1,5,7,43835.291666666417,11.53,"Valid",13.51,17.88,"Valid",23.14,null,null,11.53,13.51,17.88,23.14,17.88,23.14,11.53,13.51]
[2020,1,5,8,43835.333333333081,13.09,"Valid",13.63,21.86,"Valid",23.14,null,null,13.09,13.63,21.86,23.14,21.86,23.14,13.09,13.63]
[2020,1,5,9,43835.374999999745,15.54,"Valid",13.79,23.71,"Valid",23.33,null,null,15.54,13.79,23.71,23.33,23.71,23.33,15.54,13.79]
[2020,1,5,10,43835.41666666641,16.2,"Valid",13.99,23.96,"Valid",23.25,null,null,16.2,13.99,23.96,23.25,23.96,23.25,16.2,13.99]
[2020,1,5,11,43835.458333333074,13.66,"Valid",14.08,20.75,"Valid",23.13,null,null,13.66,14.08,20.75,23.13,20.75,23.13,13.66,14.08]
[2020,1,5,12,43835.499999999738,13.22,"Valid",14.18,21.7,"Valid",23.22,null,null,13.22,14.18,21.7,23.22,21.7,23.22,13.22,14.18]
[2020,1,5,13,43835.541666666402,16.72,"Valid",14.24,23.98,"Valid",23.07,null,null,16.72,14.24,23.98,23.07,23.98,23.07,16.72,14.24]
[2020,1,5,14,43835.583333333067,12.36,"Valid",13.63,20.18,"Valid",22.3,null,null,12.36,13.63,20.18,22.3,20.18,22.3,12.36,13.63]
[2020,1,5,15,43835.624999999731,16.62,"Valid",13.73,23.69,"Valid",22.26,null,null,16.62,13.73,23.69,22.26,23.69,22.26,16.62,13.73]
[2020,1,5,16,43835.666666666395,20.2,"Valid",14.08,29.21,"Valid",22.59,null,null,20.2,14.08,29.21,22.59,29.21,22.59,20.2,14.08]
[2020,1,5,17,43835.708333333059,23.33,"Valid",14.41,31.81,"Valid",22.88,null,null,23.33,14.41,31.81,22.88,31.81,22.88,23.33,14.41]
[2020,1,5,18,43835.749999999724,17.98,"Valid",14.46,26.15,"Valid",22.92,null,null,17.98,14.46,26.15,22.92,26.15,22.92,17.98,14.46]
[2020,1,5,19,43835.791666666388,23.9,"Valid",15.02,31.42,"Valid",23.46,null,null,23.9,15.02,31.42,23.46,31.42,23.46,23.9,15.02]
[2020,1,5,20,43835.833333333052,18.41,"Valid",15.07,27.66,"Valid",23.52,null,null,18.41,15.07,27.66,23.52,27.66,23.52,18.41,15.07]
[2020,1,5,21,43835.874999999716,36.130000000000003,"Valid",15.91,109.2,"Valid",26.88,null,null,36.130000000000003,15.91,109.2,26.88,109.2,26.88,36.130000000000003,15.91]
[2020,1,5,22,43835.91666666638,65.069999999999993,"Valid",18.059999999999999,132.15,"Valid",31.19,null,null,65.069999999999993,18.059999999999999,132.15,31.19,132.15,31.19,65.069999999999993,18.059999999999999]
{"$rows_left_out":626}
{"sheet":"Raw data_format","index":4,"n_rows":8,"n_cols":6,"rows_kept":8,"cut":false,"hidden":false,"merged":[]}
["Parameter","Format","Comment","Units of measure","Minimum","Maximum"]
["Year","yyyy","4 integer format","Not applicable",2015,"Until reporting ceases"]
["Month","mm","2 integer format","Not applicable",1,12]
["Day","dd","2 integer format","Not applicable",1,31]
["Hour","hh","2 integer format","Not applicable",0,23]
["PM10",0,"1 decimal place resolution","µg/m3","Negative","Instrument specific"]
["PM2.5",0,"2 decimal place resolution","µg/m3","Negative","Instrument specific"]
["Status","Text","7 character format","Not applicable","Valid","Invalid"]

{"sheet":"Sheet1","index":7,"n_rows":0,"n_cols":0,"rows_kept":0,"cut":false,"hidden":false,"merged":[]}