{"text_format":"1","workbook":"xlsx","n_sheets":7,"sheets":["Instructions","Meta data_sheet","Meta data_lookup","Raw data_sheet","Raw data_format","24hr_PM10_chart","24hr_PM2.5_chart"],"not_rendered":{"charts":4,"images":0,"macros":1,"external_links":0,"defined_names":10,"comments":0,"pivot_tables":0},"unopened":[{"sheet":"24hr_PM10_chart","index":5,"reason":"not_a_worksheet"},{"sheet":"24hr_PM2.5_chart","index":6,"reason":"not_a_worksheet"}],"bounds":{"document_bytes":16777216,"sheet_cells":100000,"rows_first":2000,"rows_last":500,"rows_between":2000,"halvings":0,"cell_chars":16384,"cell_head_chars":4096},"cells_cut":0,"cells_raw":0,"read":"whole","date_system":"1900"}

{"sheet":"Instructions","index":0,"n_rows":0,"n_cols":0,"rows_kept":0,"cut":false,"hidden":false,"merged":[]}

{"sheet":"Meta data_sheet","index":1,"n_rows":17,"n_cols":5,"rows_kept":17,"cut":false,"hidden":false,"merged":[[18,0,18,1],[16,0,16,1]]}
["Ambient Monitoring Station","Details",null,"Ambient Monitoring Results","Details"]
["Location","Breeza",null,"PM2.5 monitoring start (dd/mm/yyyy hh:mm)","2019-12-01"]
["Easting",{"$f":"VLOOKUP($B$2,'Meta data_lookup'!$A$2:$D$5,2,FALSE)","v":237993},null,"PM2.5 monitoring end","2020-01-01"]
["Northing",{"$f":"VLOOKUP($B$2,'Meta data_lookup'!$A$2:$D$5,3,FALSE)","v":6542606},null,"PM2.5 monitoring period (h)",{"$f":"(E3-E2)*24","v":744}]
["Site elevation (m)",{"$f":"VLOOKUP($B$2,'Meta data_lookup'!$A$2:$D$5,4,FALSE)","v":"ND"},null,"Number of valid PM2.5 results",{"$f":"COUNTIF('Raw data_sheet'!G2:G745,\"Valid\")","v":714}]
["Description of surrounding land use","Agriculture",null,"Proportion of valid PM2.5 results (%)",{"$f":"E5/E4","v":0.95967741935483875}]
["Typical sources impacting on the site","Agriculture/Gravel roads",null,"PM10 monitoring start (dd/mm/yyyy hh:mm)","2019-12-01"]
["Site compliance with AS/NZS 3580.1.1:2007","Yes",null,"PM10 monitoring end","2020-01-01"]
["PM2.5 method compliance with AS/NZS 3580.9.13:2013\n","Yes",null,"PM10 monitoring period (h)",{"$f":"(E8-E7)*24","v":744}]
["PM2.5 instrument make","Thermo",null,"Number of valid PM10 results",{"$f":"COUNTIF('Raw data_sheet'!J2:J745,\"Valid\")","v":714}]
["PM2.5 instrument model","1405DF",null,"Proportion of valid PM10 results (%)",{"$f":"E10/E9","v":0.95967741935483875}]
["PM2.5 instrument intake height (m)",3.5]
["PM10 method compliance with AS 3580.9.8-2008\n","No*"]
["PM10 instrument make","Thermo"]
["PM10 instrument model","1405DF"]
["PM10 instrument intake height (m)",3.5]
["*The 1405DF TEOM used at this site measures PM10 indirectly rather than directly. The unit does however meet the intent of AS 3580.9.8-2008, and this method has been accredited by the USEPA. It is considered scientifically robust and is used extensively throughout NSW with EPA's knowledge and informal acceptance."]

{"sheet":"Meta data_lookup","index":2,"n_rows":5,"n_cols":4,"rows_kept":5,"cut":false,"hidden":false,"merged":[]}
["Location","Easting","Northing","Site elevation (m)"]
["Maules Creek",225302,6623037,"ND"]
["Breeza",237993,6542606,"ND"]
["Will-gai",231804,6596392,"ND"]
["Werris Creek",276783,6528734,"ND"]

{"sheet":"Raw data_sheet","index":3,"n_rows":745,"n_cols":21,"rows_kept":745,"cut":false,"hidden":false,"merged":[]}
["Year","Month","Day","Hour","Date and time","PM2.5_hourly","PM2.5_Data_Status","PM2.5_24hr_rolling_average","PM10_hourly","PM10_Data_Status","PM10_24hr_rolling_average","Cause of data invalidity, if applicable","Detailed comments","PM2.5_hourly_valid_plot","PM2.5_24hr_rolling_ave_valid_plot","PM10_hourly_valid_plot","PM10_24hr_rolling_ave_valid_plot","PM10_hourly_valid_plot_series","PM10_24hr_rolling_average_valid_plot_series","PM2.5_hourly_valid_plot_series","PM2.5_24hr_rolling_average_valid_plot_series"]
[2019,12,1,0,{"$f":"DATE(A2,B2,C2)+TIME(D2,0,0)","v":43800},17.6189,"Valid",12.6,200.47290000000001,"Valid",81.900000000000006,null,null,{"$f":"IF(G2=\"Valid\", F2, NA())","v":17.6189},{"$f":"IF(G2=\"Valid\", H2, NA())","v":12.6},{"$f":"IF(J2=\"Valid\", I2, NA())","v":200.47290000000001},{"$f":"IF(J2=\"Valid\", K2, NA())","v":81.900000000000006},200.47290000000001,81.900000000000006,17.6189,12.6]
[{"$f":"A2","v":2019},{"$f":"B2","v":12},{"$f":"C2","v":1},{"$f":"IF(D2=23,0,D2+1)","v":1},{"$f":"E2+0.0416666666666666","v":43800.041666666664},22.915500000000002,"Valid",13.26,182.60849999999999,"Valid",88.04,null,null,22.915500000000002,13.26,182.60849999999999,88.04,182.60849999999999,88.04,22.915500000000002,13.26]
[{"$f":"A3","v":2019},{"$f":"B3","v":12},1,{"$f":"IF(D3=23,0,D3+1)","v":2},{"$f":"E3+0.0416666666666666","v":43800.083333333328},17.709900000000001,"Valid",13.92,157.3689,"Valid",94.06,null,null,17.709900000000001,13.92,157.3689,94.06,157.3689,94.06,17.709900000000001,13.92]
[2019,12,1,3,43800.124999999993,16.9116,"Valid",14,129.3486,"Valid",97.64,null,null,16.9116,14,129.3486,97.64,129.3486,97.64,16.9116,14]
[2019,12,1,4,43800.166666666657,16.635999999999999,"Valid",13.77,99.824200000000005,"Valid",99.28,null,null,16.635999999999999,13.77,99.824200000000005,99.28,99.824200000000005,99.28,16.635999999999999,13.77]
[2019,12,1,5,43800.208333333321,14.8826,"Valid",14.12,90.567599999999999,"Valid",100.78,null,null,14.8826,14.12,90.567599999999999,100.78,90.567599999999999,100.78,14.8826,14.12]
[2019,12,1,6,43800.249999999985,13.7578,"Valid",14.29,82.2851,"Valid",101.93,null,null,13.7578,14.29,82.2851,101.93,82.2851,101.93,13.7578,14.29]
[2019,12,1,7,43800.29166666665,6.3385499999999997,"Valid",13.8,59.700449999999996,"Valid",101.84,null,null,6.3385499999999997,13.8,59.700449999999996,101.84,59.700449999999996,101.84,6.3385499999999997,13.8]
[2019,12,1,8,43800.333333333314,3.92075,"Valid",13.63,49.744950000000003,"Valid",101.93,null,null,3.92075,13.63,49.744950000000003,101.93,49.744950000000003,101.93,3.92075,13.63]
[2019,12,1,9,43800.374999999978,5.0410599999999999,"Valid",13.12,53.720759999999999,"Valid",101.27,null,null,5.0410599999999999,13.12,53.720759999999999,101.27,53.720759999999999,101.27,5.0410599999999999,13.12]
[2019,12,1,10,43800.416666666642,6.7765700000000004,"Valid",13.17,49.061669999999999,"Valid",100.83,null,null,6.7765700000000004,13.17,49.061669999999999,100.83,49.061669999999999,100.83,6.7765700000000004,13.17]
[2019,12,1,11,43800.458333333307,8.8638200000000005,"Valid",11.86,52.317320000000002,"Valid",75.87,null,null,8.8638200000000005,11.86,52.317320000000002,75.87,52.317320000000002,75.87,8.8638200000000005,11.86]
[2019,12,1,12,43800.499999999971,10.8674,"Valid",11.37,47.237699999999997,"Valid",68.349999999999994,null,null,10.8674,11.37,47.237699999999997,68.349999999999994,47.237699999999997,68.349999999999994,10.8674,11.37]
[2019,12,1,13,43800.541666666635,9.7601099999999992,"Valid",11.49,42.373809999999999,"Valid",68.67,null,null,9.7601099999999992,11.49,42.373809999999999,68.67,42.373809999999999,68.67,9.7601099999999992,11.49]
[2019,12,1,14,43800.583333333299,7.5726399999999998,"Valid",11.4,58.78434,"Valid",70.27,null,null,7.5726399999999998,11.4,58.78434,70.27,58.78434,70.27,7.5726399999999998,11.4]
[2019,12,1,15,43800.624999999964,19.627300000000002,"Valid",11.61,216.4153,"Valid",78.19,null,null,19.627300000000002,11.61,216.4153,78.19,216.4153,78.19,19.627300000000002,11.61]
[2019,12,1,16,43800.666666666628,10.2552,"Valid",11.59,185.70519999999999,"Valid",84.52,null,null,10.2552,11.59,185.70519999999999,84.52,185.70519999999999,84.52,10.2552,11.59]
[2019,12,1,17,43800.708333333292,13.549200000000001,"Valid",11.52,136.27719999999999,"Valid",88.91,null,null,13.549200000000001,11.52,136.27719999999999,88.91,136.27719999999999,88.91,13.549200000000001,11.52]
[2019,12,1,18,43800.749999999956,8.03003,"Valid",11.89,54.56503,"Valid",90.47,null,null,8.03003,11.89,54.56503,90.47,54.56503,90.47,8.03003,11.89]
[2019,12,1,19,43800.791666666621,2.6863000000000001,"Valid",11.61,37.667900000000003,"Valid",89.73,null,null,2.6863000000000001,11.61,37.667900000000003,89.73,37.667900000000003,89.73,2.6863000000000001,11.61]
[2019,12,1,20,43800.833333333285,5.7671599999999996,"Valid",11.36,37.236159999999998,"Valid",89.55,null,null,5.7671599999999996,11.36,37.236159999999998,89.55,37.236159999999998,89.55,5.7671599999999996,11.36]
[2019,12,1,21,43800.874999999949,1.77807,"Valid",11.05,29.691669999999998,"Valid",89.18,null,null,1.77807,11.05,29.691669999999998,89.18,29.691669999999998,89.18,1.77807,11.05]
[2019,12,1,22,43800.916666666613,-0.22416,"Valid",10.55,22.289840000000002,"Valid",88.49,null,null,-0.22416,10.55,22.289840000000002,88.49,22.289840000000002,88.49,-0.22416,10.55]
[2019,{"$f":"B24","v":12},{"$f":"C24","v":1},23,43800.958333333278,15.153,"Valid",10.67,201.422,"Valid",94.86,null,null,15.153,10.67,201.422,94.86,201.422,94.86,15.153,10.67]
[2019,{"$f":"B25","v":12},{"$f":"C2+1","v":2},0,43800.999999999942,20.5791,"Valid",10.8,203.2971,"Valid",94.98,null,null,20.5791,10.8,203.2971,94.98,203.2971,94.98,20.5791,10.8]
[2019,{"$f":"B26","v":12},{"$f":"C3+1","v":2},1,43801.041666666606,15.685600000000001,"Valid",10.5,116.2456,"Valid",92.21,null,null,15.685600000000001,10.5,116.2456,92.21,116.2456,92.21,15.685600000000001,10.5]
[2019,12,2,2,43801.08333333327,10.7889,"Valid",10.210000000000001,72.520700000000005,"Valid",88.68,null,null,10.7889,10.210000000000001,72.520700000000005,88.68,72.520700000000005,88.68,10.7889,10.210000000000001]
[2019,12,2,3,43801.124999999935,7.5682799999999997,"Valid",9.82,69.904179999999997,"Valid",86.2,null,null,7.5682799999999997,9.82,69.904179999999997,86.2,69.904179999999997,86.2,7.5682799999999997,9.82]
[2019,12,2,4,43801.166666666599,10.154500000000001,"Valid",9.5500000000000007,50.244799999999998,"Valid",84.14,null,null,10.154500000000001,9.5500000000000007,50.244799999999998,84.14,50.244799999999998,84.14,10.154500000000001,9.5500000000000007]
[2019,12,2,5,43801.208333333263,5.2516400000000001,"Valid",9.15,37.86054,"Valid",81.94,null,null,5.2516400000000001,9.15,37.86054,81.94,37.86054,81.94,5.2516400000000001,9.15]
[2019,12,2,6,43801.249999999927,3.8327,"Valid",8.73,35.828800000000001,"Valid",80,null,null,3.8327,8.73,35.828800000000001,80,35.828800000000001,80,3.8327,8.73]
[2019,12,2,7,43801.291666666591,10.036199999999999,"Valid",8.89,43.192799999999998,"Valid",79.319999999999993,null,null,10.036199999999999,8.89,43.192799999999998,79.319999999999993,43.192799999999998,79.319999999999993,10.036199999999999,8.89]
[2019,12,2,8,43801.333333333256,-0.20441599999999999,"Valid",8.7200000000000006,49.812584000000001,"Valid",79.319999999999993,null,null,-0.20441599999999999,8.7200000000000006,49.812584000000001,79.319999999999993,49.812584000000001,79.319999999999993,-0.20441599999999999,8.7200000000000006]
[2019,12,2,9,43801.37499999992,{"$f":"NA()","v":{"$error":"#N/A"}},"Invalid",{"$f":"NA()","v":{"$error":"#N/A"}},{"$f":"NA()","v":{"$error":"#N/A"}},"Invalid",{"$f":"NA()","v":{"$error":"#N/A"}},"Pump Failure","High negative removed",{"$error":"#N/A"},{"$error":"#N/A"},{"$error":"#N/A"},{"$error":"#N/A"}]
[2019,12,2,10,43801.416666666584,9.5936500000000002,"Valid",9,37.375250000000001,"Valid",76.83,null,null,9.5936500000000002,9,37.375250000000001,76.83,37.375250000000001,76.83,9.5936500000000002,9]
[2019,12,2,11,43801.458333333248,5.7067100000000002,"Valid",8.86,69.266409999999993,"Valid",77.540000000000006,null,null,5.7067100000000002,8.86,69.266409999999993,77.540000000000006,69.266409999999993,77.540000000000006,5.7067100000000002,8.86]
[2019,12,2,12,43801.499999999913,13.521699999999999,"Valid",8.98,38.656199999999998,"Valid",77.180000000000007,null,null,13.521699999999999,8.98,38.656199999999998,77.180000000000007,38.656199999999998,77.180000000000007,13.521699999999999,8.98]
[2019,12,2,13,43801.541666666577,12.157299999999999,"Valid",9.08,45.493600000000001,"Valid",77.31,null,null,12.157299999999999,9.08,45.493600000000001,77.31,45.493600000000001,77.31,12.157299999999999,9.08]
[2019,12,2,14,43801.583333333241,11.3398,"Valid",9.24,249.0908,"Valid",85.24,null,null,11.3398,9.24,249.0908,85.24,249.0908,85.24,11.3398,9.24]
[2019,12,2,15,43801.624999999905,13.4786,"Valid",8.98,269.10059999999999,"Valid",87.43,null,null,13.4786,8.98,269.10059999999999,87.43,269.10059999999999,87.43,13.4786,8.98]
[2019,12,2,16,43801.66666666657,28.5731,"Valid",9.77,458.71109999999999,"Valid",98.81,null,null,28.5731,9.77,458.71109999999999,98.81,458.71109999999999,98.81,28.5731,9.77]
[2019,12,2,17,43801.708333333234,17.348700000000001,"Valid",9.94,246.6747,"Valid",103.41,null,null,17.348700000000001,9.94,246.6747,103.41,246.6747,103.41,17.348700000000001,9.94]
[2019,12,2,18,43801.749999999898,{"$f":"NA()","v":{"$error":"#N/A"}},"Invalid",{"$f":"NA()","v":{"$error":"#N/A"}},{"$f":"NA()","v":{"$error":"#N/A"}},"Invalid",{"$f":"NA()","v":{"$error":"#N/A"}},"Calibration Error","Annual calibration, zero test data excluded. ",{"$error":"#N/A"},{"$error":"#N/A"},{"$error":"#N/A"},{"$error":"#N/A"}]
[2019,12,2,19,43801.791666666562,{"$f":"NA()","v":{"$error":"#N/A"}},"Invalid",{"$f":"NA()","v":{"$error":"#N/A"}},{"$f":"NA()","v":{"$error":"#N/A"}},"Invalid",{"$f":"NA()","v":{"$error":"#N/A"}},"Calibration Error","Annual calibration, zero test data excluded. ",{"$error":"#N/A"},{"$error":"#N/A"},{"$error":"#N/A"},{"$error":"#N/A"}]
[2019,12,2,20,43801.833333333227,{"$f":"NA()","v":{"$error":"#N/A"}},"Invalid",{"$f":"NA()","v":{"$error":"#N/A"}},{"$f":"NA()","v":{"$error":"#N/A"}},"Invalid",{"$f":"NA()","v":{"$error":"#N/A"}},"Calibration Error","Annual calibration, zero test data excluded. ",{"$error":"#N/A"},{"$error":"#N/A"},{"$error":"#N/A"},{"$error":"#N/A"}]
[2019,12,2,21,43801.874999999891,{"$f":"NA()","v":{"$error":"#N/A"}},"Invalid",{"$f":"NA()","v":{"$error":"#N/A"}},{"$f":"NA()","v":{"$error":"#N/A"}},"Invalid",{"$f":"NA()","v":{"$error":"#N/A"}},"Calibration Error","Annual calibration, zero test data excluded. ",{"$error":"#N/A"},{"$error":"#N/A"},{"$error":"#N/A"},{"$error":"#N/A"}]
[2019,12,2,22,43801.916666666555,{"$f":"NA()","v":{"$error":"#N/A"}},"Invalid",{"$f":"NA()","v":{"$error":"#N/A"}},{"$f":"NA()","v":{"$error":"#N/A"}},"Invalid",{"$f":"NA()","v":{"$error":"#N/A"}},"Calibration Error","Annual calibration, zero test data excluded. ",{"$error":"#N/A"},{"$error":"#N/A"},{"$error":"#N/A"},{"$error":"#N/A"}]
[2019,12,2,23,43801.958333333219,{"$f":"NA()","v":{"$error":"#N/A"}},"Invalid",{"$f":"NA()","v":{"$error":"#N/A"}},{"$f":"NA()","v":{"$error":"#N/A"}},"Invalid",{"$f":"NA()","v":{"$error":"#N/A"}},"Calibration Error","Annual calibration, zero test data excluded. 24Hr average lost due to data interruption.",{"$error":"#N/A"},{"$error":"#N/A"},{"$error":"#N/A"},{"$error":"#N/A"}]
[2019,12,3,0,43801.999999999884,{"$f":"NA()","v":{"$error":"#N/A"}},"Invalid",{"$f":"NA()","v":{"$error":"#N/A"}},{"$f":"NA()","v":{"$error":"#N/A"}},"Invalid",{"$f":"NA()","v":{"$error":"#N/A"}},"Calibration Error","Annual calibration, zero test data excluded. 24Hr average lost due to data interruption.",{"$error":"#N/A"},{"$error":"#N/A"},{"$error":"#N/A"},{"$error":"#N/A"}]
[2019,12,3,1,43802.041666666548,{"$f":"NA()","v":{"$error":"#N/A"}},"Invalid",{"$f":"NA()","v":{"$error":"#N/A"}},{"$f":"NA()","v":{"$error":"#N/A"}},"Invalid",{"$f":"NA()","v":{"$error":"#N/A"}},"Calibration Error","Annual calibration, zero test data excluded. 24Hr average lost due to data interruption.",{"$error":"#N/A"},{"$error":"#N/A"},{"$error":"#N/A"},{"$error":"#N/A"}]
[2019,12,3,2,43802.083333333212,{"$f":"NA()","v":{"$error":"#N/A"}},"Invalid",{"$f":"NA()","v":{"$error":"#N/A"}},{"$f":"NA()","v":{"$error":"#N/A"}},"Invalid",{"$f":"NA()","v":{"$error":"#N/A"}},"Calibration Error","Annual calibration, zero test data excluded. 24Hr average lost due to data interruption.",{"$error":"#N/A"},{"$error":"#N/A"},{"$error":"#N/A"},{"$error":"#N/A"}]
[2019,12,3,3,43802.124999999876,{"$f":"NA()","v":{"$error":"#N/A"}},"Invalid",{"$f":"NA()","v":{"$error":"#N/A"}},{"$f":"NA()","v":{"$error":"#N/A"}},"Invalid",{"$f":"NA()","v":{"$error":"#N/A"}},"Calibration Error","Annual calibration, zero test data excluded. 24Hr average lost due to data interruption.",{"$error":"#N/A"},{"$error":"#N/A"},{"$error":"#N/A"},{"$error":"#N/A"}]
[2019,12,3,4,43802.166666666541,{"$f":"NA()","v":{"$error":"#N/A"}},"Invalid",{"$f":"NA()","v":{"$error":"#N/A"}},{"$f":"NA()","v":{"$error":"#N/A"}},"Invalid",{"$f":"NA()","v":{"$error":"#N/A"}},"Calibration Error","Annual calibration, zero test data excluded. 24Hr average lost due to data interruption.",{"$error":"#N/A"},{"$error":"#N/A"},{"$error":"#N/A"},{"$error":"#N/A"}]
[2019,12,3,5,43802.208333333205,{"$f":"NA()","v":{"$error":"#N/A"}},"Invalid",{"$f":"NA()","v":{"$error":"#N/A"}},{"$f":"NA()","v":{"$error":"#N/A"}},"Invalid",{"$f":"NA()","v":{"$error":"#N/A"}},"Calibration Error","Annual calibration, zero test data excluded. 24Hr average lost due to data interruption.",{"$error":"#N/A"},{"$error":"#N/A"},{"$error":"#N/A"},{"$error":"#N/A"}]
[2019,12,3,6,43802.249999999869,{"$f":"NA()","v":{"$error":"#N/A"}},"Invalid",{"$f":"NA()","v":{"$error":"#N/A"}},{"$f":"NA()","v":{"$error":"#N/A"}},"Invalid",{"$f":"NA()","v":{"$error":"#N/A"}},"Calibration Error","Annual calibration, zero test data excluded. 24Hr average lost due to data interruption.",{"$error":"#N/A"},{"$error":"#N/A"},{"$error":"#N/A"},{"$error":"#N/A"}]
[2019,12,3,7,43802.291666666533,{"$f":"NA()","v":{"$error":"#N/A"}},"Invalid",{"$f":"NA()","v":{"$error":"#N/A"}},{"$f":"NA()","v":{"$error":"#N/A"}},"Invalid",{"$f":"NA()","v":{"$error":"#N/A"}},"Calibration Error","Annual calibration, zero test data excluded. 24Hr average lost due to data interruption.",{"$error":"#N/A"},{"$error":"#N/A"},{"$error":"#N/A"},{"$error":"#N/A"}]
[2019,12,3,8,43802.333333333198,{"$f":"NA()","v":{"$error":"#N/A"}},"Invalid",{"$f":"NA()","v":{"$error":"#N/A"}},{"$f":"NA()","v":{"$error":"#N/A"}},"Invalid",{"$f":"NA()","v":{"$error":"#N/A"}},"Calibration Error","Annual calibration, zero test data excluded. 24Hr average lost due to data interruption.",{"$error":"#N/A"},{"$error":"#N/A"},{"$error":"#N/A"},{"$error":"#N/A"}]
[2019,12,3,9,43802.374999999862,{"$f":"NA()","v":{"$error":"#N/A"}},"Invalid",{"$f":"NA()","v":{"$error":"#N/A"}},{"$f":"NA()","v":{"$error":"#N/A"}},"Invalid",{"$f":"NA()","v":{"$error":"#N/A"}},"Calibration Error","Annual calibration, zero test data excluded. 24Hr average lost due to data interruption.",{"$error":"#N/A"},{"$error":"#N/A"},{"$error":"#N/A"},{"$error":"#N/A"}]
[2019,12,3,10,43802.416666666526,5.6060299999999996,"Valid",{"$f":"NA()","v":{"$error":"#N/A"}},36.241430000000001,"Valid",{"$f":"NA()","v":{"$error":"#N/A"}},null,"24Hr average lost due to data interruption",5.6060299999999996,{"$error":"#N/A"},36.241430000000001,{"$error":"#N/A"},36.241430000000001,null,5.6060299999999996]
[2019,12,3,11,43802.45833333319,8.3230599999999999,"Valid",{"$f":"NA()","v":{"$error":"#N/A"}},35.481059999999999,"Valid",{"$f":"NA()","v":{"$error":"#N/A"}},null,"24Hr average lost due to data interruption",8.3230599999999999,{"$error":"#N/A"},35.481059999999999,{"$error":"#N/A"},35.481059999999999,null,8.3230599999999999]
[2019,12,3,12,43802.499999999854,6.0374299999999996,"Valid",{"$f":"NA()","v":{"$error":"#N/A"}},30.895330000000001,"Valid",{"$f":"NA()","v":{"$error":"#N/A"}},null,"24Hr average lost due to data interruption",6.0374299999999996,{"$error":"#N/A"},30.895330000000001,{"$error":"#N/A"},30.895330000000001,null,6.0374299999999996]
[2019,12,3,13,43802.541666666519,8.0207099999999993,"Valid",{"$f":"NA()","v":{"$error":"#N/A"}},33.773510000000002,"Valid",{"$f":"NA()","v":{"$error":"#N/A"}},null,"24Hr average lost due to data interruption",8.0207099999999993,{"$error":"#N/A"},33.773510000000002,{"$error":"#N/A"},33.773510000000002,null,8.0207099999999993]
[2019,12,3,14,43802.583333333183,4.5321699999999998,"Valid",{"$f":"NA()","v":{"$error":"#N/A"}},35.187269999999998,"Valid",{"$f":"NA()","v":{"$error":"#N/A"}},null,"24Hr average lost due to data interruption",4.5321699999999998,{"$error":"#N/A"},35.187269999999998,{"$error":"#N/A"},35.187269999999998,null,4.5321699999999998]
[2019,12,3,15,43802.624999999847,4.8201900000000002,"Valid",{"$f":"NA()","v":{"$error":"#N/A"}},29.545290000000001,"Valid",{"$f":"NA()","v":{"$error":"#N/A"}},null,"24Hr average lost due to data interruption",4.8201900000000002,{"$error":"#N/A"},29.545290000000001,{"$error":"#N/A"},29.545290000000001,null,4.8201900000000002]
[2019,12,3,16,43802.666666666511,6.3495999999999997,"Valid",{"$f":"NA()","v":{"$error":"#N/A"}},27.47,"Valid",{"$f":"NA()","v":{"$error":"#N/A"}},null,"24Hr average lost due to data interruption",{"$f":"IF(G66=\"Valid\", F66, NA())","v":6.3495999999999997},{"$f":"IF(G66=\"Valid\", H66, NA())","v":{"$error":"#N/A"}},{"$f":"IF(J66=\"Valid\", I66, NA())","v":27.47},{"$f":"IF(J66=\"Valid\", K66, NA())","v":{"$error":"#N/A"}},27.47,null,6.3495999999999997]
[2019,12,3,17,43802.708333333176,3.5127799999999998,"Valid",{"$f":"NA()","v":{"$error":"#N/A"}},19.25498,"Valid",{"$f":"NA()","v":{"$error":"#N/A"}},null,"24Hr average lost due to data interruption",3.5127799999999998,{"$error":"#N/A"},19.25498,{"$error":"#N/A"},19.25498,null,3.5127799999999998]
[{"$f":"A67","v":2019},12,3,{"$f":"IF(D67=23,0,D67+1)","v":18},{"$f":"E67+0.0416666666666666","v":43802.74999999984},5.5492100000000004,"Valid",{"$f":"NA()","v":{"$error":"#N/A"}},20.310110000000002,"Valid",{"$f":"NA()","v":{"$error":"#N/A"}},null,"24Hr average lost due to data interruption",5.5492100000000004,{"$error":"#N/A"},20.310110000000002,{"$error":"#N/A"},20.310110000000002,null,5.5492100000000004]
[2019,12,3,19,43802.791666666504,6.8875500000000001,"Valid",{"$f":"NA()","v":{"$error":"#N/A"}},23.138649999999998,"Valid",{"$f":"NA()","v":{"$error":"#N/A"}},null,"24Hr average lost due to data interruption",6.8875500000000001,{"$error":"#N/A"},23.138649999999998,{"$error":"#N/A"},23.138649999999998,null,6.8875500000000001]
[2019,12,3,20,43802.833333333168,2.41595,"Valid",{"$f":"NA()","v":{"$error":"#N/A"}},16.670449999999999,"Valid",{"$f":"NA()","v":{"$error":"#N/A"}},null,"24Hr average lost due to data interruption",2.41595,{"$error":"#N/A"},16.670449999999999,{"$error":"#N/A"},16.670449999999999,null,2.41595]
[2019,12,3,21,43802.874999999833,0.64695599999999998,"Valid",{"$f":"NA()","v":{"$error":"#N/A"}},16.386455999999999,"Valid",{"$f":"NA()","v":{"$error":"#N/A"}},null,"24Hr average lost due to data interruption",0.64695599999999998,{"$error":"#N/A"},16.386455999999999,{"$error":"#N/A"},16.386455999999999,null,0.64695599999999998]
[2019,12,3,22,43802.916666666497,2.54358,"Valid",{"$f":"NA()","v":{"$error":"#N/A"}},16.310780000000001,"Valid",{"$f":"NA()","v":{"$error":"#N/A"}},null,"24Hr average lost due to data interruption",2.54358,{"$error":"#N/A"},16.310780000000001,{"$error":"#N/A"},16.310780000000001,null,2.54358]
[2019,12,3,23,43802.958333333161,0.70573300000000005,"Valid",{"$f":"NA()","v":{"$error":"#N/A"}},12.924433000000001,"Valid",{"$f":"NA()","v":{"$error":"#N/A"}},null,"24Hr average lost due to data interruption",0.70573300000000005,{"$error":"#N/A"},12.924433000000001,{"$error":"#N/A"},12.924433000000001,null,0.70573300000000005]
[2019,12,4,0,43802.999999999825,1.50875,"Valid",{"$f":"NA()","v":{"$error":"#N/A"}},13.477449999999999,"Valid",{"$f":"NA()","v":{"$error":"#N/A"}},null,"24Hr average lost due to data interruption",1.50875,{"$error":"#N/A"},13.477449999999999,{"$error":"#N/A"},13.477449999999999,null,1.50875]
[2019,12,4,1,43803.04166666649,2.09843,"Valid",{"$f":"NA()","v":{"$error":"#N/A"}},13.620430000000001,"Valid",{"$f":"NA()","v":{"$error":"#N/A"}},null,"24Hr average lost due to data interruption",2.09843,{"$error":"#N/A"},13.620430000000001,{"$error":"#N/A"},13.620430000000001,null,2.09843]
[2019,12,4,2,43803.083333333154,-0.78055300000000005,"Valid",{"$f":"NA()","v":{"$error":"#N/A"}},10.627046999999999,"Valid",{"$f":"NA()","v":{"$error":"#N/A"}},null,"24Hr average lost due to data interruption",-0.78055300000000005,{"$error":"#N/A"},10.627046999999999,{"$error":"#N/A"},10.627046999999999,null,-0.78055300000000005]
[2019,12,4,3,43803.124999999818,1.33266,"Valid",3.9,13.856260000000001,"Valid",22.51,null,null,1.33266,3.9,13.856260000000001,22.51,13.856260000000001,22.51,1.33266,3.9]
[2019,12,4,4,43803.166666666482,3.9657499999999999,"Valid",3.9,14.90915,"Valid",22.11,null,null,3.9657499999999999,3.9,14.90915,22.11,14.90915,22.11,3.9657499999999999,3.9]
[2019,12,4,5,43803.208333333147,8.8693899999999992,"Valid",4.1500000000000004,19.412990000000001,"Valid",21.97,null,null,8.8693899999999992,4.1500000000000004,19.412990000000001,21.97,19.412990000000001,21.97,8.8693899999999992,4.1500000000000004]
[2019,12,4,6,43803.249999999811,8.68642,"Valid",4.3600000000000003,20.968620000000001,"Valid",21.93,null,null,8.68642,4.3600000000000003,20.968620000000001,21.93,20.968620000000001,21.93,8.68642,4.3600000000000003]
{"$rows_left_out":666}
{"sheet":"Raw data_format","index":4,"n_rows":8,"n_cols":6,"rows_kept":8,"cut":false,"hidden":false,"merged":[]}
["Parameter","Format","Comment","Units of measure","Minimum","Maximum"]
["Year","yyyy","4 integer format","Not applicable",2015,"Until reporting ceases"]
["Month","mm","2 integer format","Not applicable",1,12]
["Day","dd","2 integer format","Not applicable",1,31]
["Hour","hh","2 integer format","Not applicable",0,23]
["PM10",0,"1 decimal place resolution","µg/m3","Negative","Instrument specific"]
["PM2.5",0,"2 decimal place resolution","µg/m3","Negative","Instrument specific"]
["Status","Text","7 character format","Not applicable","Valid","Invalid"]