{"text_format":"1","workbook":"xlsx","n_sheets":7,"sheets":["Instructions","Meta data_sheet","Meta data_lookup","Raw data_sheet","Raw data_format","24hr_PM10_chart","24hr_PM2.5_chart"],"not_rendered":{"charts":4,"images":0,"macros":1,"external_links":0,"defined_names":10,"comments":0,"pivot_tables":0},"unopened":[{"sheet":"24hr_PM10_chart","index":5,"reason":"not_a_worksheet"},{"sheet":"24hr_PM2.5_chart","index":6,"reason":"not_a_worksheet"}],"bounds":{"document_bytes":16777216,"sheet_cells":100000,"rows_first":2000,"rows_last":500,"rows_between":2000,"halvings":0,"cell_chars":16384,"cell_head_chars":4096},"cells_cut":0,"cells_raw":0,"read":"whole","date_system":"1900"}

{"sheet":"Instructions","index":0,"n_rows":0,"n_cols":0,"rows_kept":0,"cut":false,"hidden":false,"merged":[]}

{"sheet":"Meta data_sheet","index":1,"n_rows":17,"n_cols":5,"rows_kept":17,"cut":false,"hidden":false,"merged":[[18,0,18,1],[16,0,16,1]]}
["Ambient Monitoring Station","Details",null,"Ambient Monitoring Results","Details"]
["Location","Breeza",null,"PM2.5 monitoring start (dd/mm/yyyy hh:mm)","2019-11-01"]
["Easting",{"$f":"VLOOKUP($B$2,'Meta data_lookup'!$A$2:$D$5,2,FALSE)","v":237993},null,"PM2.5 monitoring end","2019-12-01"]
["Northing",{"$f":"VLOOKUP($B$2,'Meta data_lookup'!$A$2:$D$5,3,FALSE)","v":6542606},null,"PM2.5 monitoring period (h)",{"$f":"(E3-E2)*24","v":720}]
["Site elevation (m)",{"$f":"VLOOKUP($B$2,'Meta data_lookup'!$A$2:$D$5,4,FALSE)","v":"ND"},null,"Number of valid PM2.5 results",{"$f":"COUNTIF('Raw data_sheet'!G2:G745,\"Valid\")","v":693}]
["Description of surrounding land use","Agriculture",null,"Proportion of valid PM2.5 results (%)",{"$f":"E5/E4","v":0.96250000000000002}]
["Typical sources impacting on the site","Agriculture/Gravel roads",null,"PM10 monitoring start (dd/mm/yyyy hh:mm)","2019-11-01"]
["Site compliance with AS/NZS 3580.1.1:2007","Yes",null,"PM10 monitoring end","2019-12-01"]
["PM2.5 method compliance with AS/NZS 3580.9.13:2013\n","Yes",null,"PM10 monitoring period (h)",{"$f":"(E8-E7)*24","v":720}]
["PM2.5 instrument make","Thermo",null,"Number of valid PM10 results",{"$f":"COUNTIF('Raw data_sheet'!J2:J745,\"Valid\")","v":693}]
["PM2.5 instrument model","1405DF",null,"Proportion of valid PM10 results (%)",{"$f":"E10/E9","v":0.96250000000000002}]
["PM2.5 instrument intake height (m)",3.5]
["PM10 method compliance with AS 3580.9.8-2008\n","No*"]
["PM10 instrument make","Thermo"]
["PM10 instrument model","1405DF"]
["PM10 instrument intake height (m)",3.5]
["*The 1405DF TEOM used at this site measures PM10 indirectly rather than directly. The unit does however meet the intent of AS 3580.9.8-2008, and this method has been accredited by the USEPA. It is considered scientifically robust and is used extensively throughout NSW with EPA's knowledge and informal acceptance."]

{"sheet":"Meta data_lookup","index":2,"n_rows":5,"n_cols":4,"rows_kept":5,"cut":false,"hidden":false,"merged":[]}
["Location","Easting","Northing","Site elevation (m)"]
["Maules Creek",225302,6623037,"ND"]
["Breeza",237993,6542606,"ND"]
["Will-gai",231804,6596392,"ND"]
["Werris Creek",276783,6528734,"ND"]

{"sheet":"Raw data_sheet","index":3,"n_rows":745,"n_cols":21,"rows_kept":745,"cut":false,"hidden":false,"merged":[]}
["Year","Month","Day","Hour","Date and time","PM2.5_hourly","PM2.5_Data_Status","PM2.5_24hr_rolling_average","PM10_hourly","PM10_Data_Status","PM10_24hr_rolling_average","Cause of data invalidity, if applicable","Detailed comments","PM2.5_hourly_valid_plot","PM2.5_24hr_rolling_ave_valid_plot","PM10_hourly_valid_plot","PM10_24hr_rolling_ave_valid_plot","PM10_hourly_valid_plot_series","PM10_24hr_rolling_average_valid_plot_series","PM2.5_hourly_valid_plot_series","PM2.5_24hr_rolling_average_valid_plot_series"]
[2019,11,1,0,{"$f":"DATE(A2,B2,C2)+TIME(D2,0,0)","v":43770},40.79,"Valid",18.940000000000001,53.93,"Valid",51.1,null,null,{"$f":"IF(G2=\"Valid\", F2, NA())","v":40.79},{"$f":"IF(G2=\"Valid\", H2, NA())","v":18.940000000000001},{"$f":"IF(J2=\"Valid\", I2, NA())","v":53.93},{"$f":"IF(J2=\"Valid\", K2, NA())","v":51.1},53.93,51.1,40.79,18.940000000000001]
[{"$f":"A2","v":2019},{"$f":"B2","v":11},{"$f":"C2","v":1},{"$f":"IF(D2=23,0,D2+1)","v":1},{"$f":"E2+0.0416666666666666","v":43770.041666666664},31.4,"Valid",19.89,42.75,"Valid",51.58,null,null,31.4,19.89,42.75,51.58,42.75,51.58,31.4,19.89]
[{"$f":"A3","v":2019},{"$f":"B3","v":11},1,{"$f":"IF(D3=23,0,D3+1)","v":2},{"$f":"E3+0.0416666666666666","v":43770.083333333328},30.8,"Valid",20.66,43.16,"Valid",52.04,null,null,30.8,20.66,43.16,52.04,43.16,52.04,30.8,20.66]
[2019,11,1,3,43770.124999999993,33.5,"Valid",21.54,46.7,"Valid",52.7,null,null,33.5,21.54,46.7,52.7,46.7,52.7,33.5,21.54]
[2019,11,1,4,43770.166666666657,37.409999999999997,"Valid",22.73,54.06,"Valid",53.74,null,null,37.409999999999997,22.73,54.06,53.74,54.06,53.74,37.409999999999997,22.73]
[2019,11,1,5,43770.208333333321,31.95,"Valid",23.68,48.37,"Valid",54.55,null,null,31.95,23.68,48.37,54.55,48.37,54.55,31.95,23.68]
[2019,11,1,6,43770.249999999985,32.130000000000003,"Valid",24.37,46.14,"Valid",55.01,null,null,32.130000000000003,24.37,46.14,55.01,46.14,55.01,32.130000000000003,24.37]
[2019,11,1,7,43770.29166666665,32.340000000000003,"Valid",25.16,56.37,"Valid",55.81,null,null,32.340000000000003,25.16,56.37,55.81,56.37,55.81,32.340000000000003,25.16]
[2019,11,1,8,43770.333333333314,28.31,"Valid",25.8,49.92,"Valid",56.36,null,null,28.31,25.8,49.92,56.36,49.92,56.36,28.31,25.8]
[2019,11,1,9,43770.374999999978,33.6,"Valid",26.62,48.63,"Valid",56.14,null,null,33.6,26.62,48.63,56.14,48.63,56.14,33.6,26.62]
[2019,11,1,10,43770.416666666642,30.42,"Valid",27.37,44.02,"Valid",56.07,null,null,30.42,27.37,44.02,56.07,44.02,56.07,30.42,27.37]
[2019,11,1,11,43770.458333333307,33.54,"Valid",28.32,49.79,"Valid",56.53,null,null,33.54,28.32,49.79,56.53,49.79,56.53,33.54,28.32]
[2019,11,1,12,43770.499999999971,29.51,"Valid",28.97,46.29,"Valid",56.22,null,null,29.51,28.97,46.29,56.22,46.29,56.22,29.51,28.97]
[2019,11,1,13,43770.541666666635,27.67,"Valid",29.72,62.69,"Valid",57.31,null,null,27.67,29.72,62.69,57.31,62.69,57.31,27.67,29.72]
[2019,11,1,14,43770.583333333299,26.82,"Valid",29.71,43.19,"Valid",57.04,null,null,26.82,29.71,43.19,57.04,43.19,57.04,26.82,29.71]
[2019,11,1,15,43770.624999999964,33.31,"Valid",30.07,50.42,"Valid",57.01,null,null,33.31,30.07,50.42,57.01,50.42,57.01,33.31,30.07]
[2019,11,1,16,43770.666666666628,37.01,"Valid",30.44,50.04,"Valid",56.86,null,null,37.01,30.44,50.04,56.86,50.04,56.86,37.01,30.44]
[2019,11,1,17,43770.708333333292,36.909999999999997,"Valid",30.7,52.57,"Valid",48.67,null,null,36.909999999999997,30.7,52.57,48.67,52.57,48.67,36.909999999999997,30.7]
[2019,11,1,18,43770.749999999956,32.57,"Valid",31.24,45.28,"Valid",48.12,null,null,32.57,31.24,45.28,48.12,45.28,48.12,32.57,31.24]
[2019,11,1,19,43770.791666666621,30.87,"Valid",31.91,42.56,"Valid",48.73,null,null,30.87,31.91,42.56,48.73,42.56,48.73,30.87,31.91]
[2019,11,1,20,43770.833333333285,33.64,"Valid",32.29,71.08,"Valid",50.08,null,null,33.64,32.29,71.08,50.08,71.08,50.08,33.64,32.29]
[2019,11,1,21,43770.874999999949,33.44,"Valid",32.799999999999997,62.4,"Valid",50.57,null,null,33.44,32.799999999999997,62.4,50.57,62.4,50.57,33.44,32.799999999999997]
[2019,11,1,22,43770.916666666613,48.41,"Valid",33.82,65.95,"Valid",51.47,null,null,48.41,33.82,65.95,51.47,65.95,51.47,48.41,33.82]
[2019,{"$f":"B24","v":11},{"$f":"C24","v":1},23,43770.958333333278,39.46,"Valid",33.58,51.11,"Valid",51.14,null,null,39.46,33.58,51.11,51.14,51.11,51.14,39.46,33.58]
[2019,{"$f":"B25","v":11},{"$f":"C2+1","v":2},0,43770.999999999942,26.44,"Valid",32.979999999999997,38.51,"Valid",50.5,null,null,26.44,32.979999999999997,38.51,50.5,38.51,50.5,26.44,32.979999999999997]
[2019,{"$f":"B26","v":11},{"$f":"C3+1","v":2},1,43771.041666666606,23.73,"Valid",32.659999999999997,36.43,"Valid",50.24,null,null,23.73,32.659999999999997,36.43,50.24,36.43,50.24,23.73,32.659999999999997]
[2019,11,2,2,43771.08333333327,19.05,"Valid",32.17,36.869999999999997,"Valid",49.97,null,null,19.05,32.17,36.869999999999997,49.97,36.869999999999997,49.97,19.05,32.17]
[2019,11,2,3,43771.124999999935,13.15,"Valid",31.32,27.73,"Valid",49.18,null,null,13.15,31.32,27.73,49.18,27.73,49.18,13.15,31.32]
[2019,11,2,4,43771.166666666599,12.47,"Valid",30.28,24.52,"Valid",47.95,null,null,12.47,30.28,24.52,47.95,24.52,47.95,12.47,30.28]
[2019,11,2,5,43771.208333333263,10,"Valid",29.37,17.59,"Valid",46.67,null,null,10,29.37,17.59,46.67,17.59,46.67,10,29.37]
[2019,11,2,6,43771.249999999927,9.51,"Valid",28.42,19.16,"Valid",45.55,null,null,9.51,28.42,19.16,45.55,19.16,45.55,9.51,28.42]
[2019,11,2,7,43771.291666666591,8.49,"Valid",27.43,17.38,"Valid",43.92,null,null,8.49,27.43,17.38,43.92,17.38,43.92,8.49,27.43]
[2019,11,2,8,43771.333333333256,8.08,"Valid",26.59,18.12,"Valid",42.6,null,null,8.08,26.59,18.12,42.6,18.12,42.6,8.08,26.59]
[2019,11,2,9,43771.37499999992,6.64,"Valid",25.46,13.74,"Valid",41.14,null,null,6.64,25.46,13.74,41.14,13.74,41.14,6.64,25.46]
[2019,11,2,10,43771.416666666584,12.68,"Valid",24.73,19.79,"Valid",40.130000000000003,null,null,12.68,24.73,19.79,40.130000000000003,19.79,40.130000000000003,12.68,24.73]
[2019,11,2,11,43771.458333333248,13.95,"Valid",23.91,23.86,"Valid",39.049999999999997,null,null,13.95,23.91,23.86,39.049999999999997,23.86,39.049999999999997,13.95,23.91]
[2019,11,2,12,43771.499999999913,17.170000000000002,"Valid",23.39,27.48,"Valid",38.270000000000003,null,null,17.170000000000002,23.39,27.48,38.270000000000003,27.48,38.270000000000003,17.170000000000002,23.39]
[2019,11,2,13,43771.541666666577,10.94,"Valid",22.7,22.21,"Valid",36.58,null,null,10.94,22.7,22.21,36.58,22.21,36.58,10.94,22.7]
[2019,11,2,14,43771.583333333241,13.57,"Valid",22.15,22.49,"Valid",35.72,null,null,13.57,22.15,22.49,35.72,22.49,35.72,13.57,22.15]
[2019,11,2,15,43771.624999999905,12,"Valid",21.26,22.43,"Valid",34.549999999999997,null,null,12,21.26,22.43,34.549999999999997,22.43,34.549999999999997,12,21.26]
[2019,11,2,16,43771.66666666657,15.04,"Valid",20.34,28.32,"Valid",33.65,null,null,15.04,20.34,28.32,33.65,28.32,33.65,15.04,20.34]
[2019,11,2,17,43771.708333333234,15.58,"Valid",19.45,31.96,"Valid",32.79,null,null,15.58,19.45,31.96,32.79,31.96,32.79,15.58,19.45]
[2019,11,2,18,43771.749999999898,12.82,"Valid",18.63,32.69,"Valid",32.270000000000003,null,null,12.82,18.63,32.69,32.270000000000003,32.69,32.270000000000003,12.82,18.63]
[2019,11,2,19,43771.791666666562,14.42,"Valid",17.95,35.450000000000003,"Valid",31.97,null,null,14.42,17.95,35.450000000000003,31.97,35.450000000000003,31.97,14.42,17.95]
[2019,11,2,20,43771.833333333227,21.43,"Valid",17.440000000000001,41.17,"Valid",30.72,null,null,21.43,17.440000000000001,41.17,30.72,41.17,30.72,21.43,17.440000000000001]
[2019,11,2,21,43771.874999999891,13.03,"Valid",16.59,34.39,"Valid",29.56,null,null,13.03,16.59,34.39,29.56,34.39,29.56,13.03,16.59]
[2019,11,2,22,43771.916666666555,4.21,"Valid",14.74,16.989999999999998,"Valid",27.52,null,null,4.21,14.74,16.989999999999998,27.52,16.989999999999998,27.52,4.21,14.74]
[2019,11,2,23,43771.958333333219,5.52,"Valid",13.33,16.670000000000002,"Valid",26.08,null,null,5.52,13.33,16.670000000000002,26.08,16.670000000000002,26.08,5.52,13.33]
[2019,11,3,0,43771.999999999884,4.08,"Valid",12.4,15.94,"Valid",25.14,null,null,4.08,12.4,15.94,25.14,15.94,25.14,4.08,12.4]
[2019,11,3,1,43772.041666666548,0.04,"Valid",11.41,12.88,"Valid",24.16,null,null,0.04,11.41,12.88,24.16,12.88,24.16,0.04,11.41]
[2019,11,3,2,43772.083333333212,6.44,"Valid",10.89,17.97,"Valid",23.37,null,null,6.44,10.89,17.97,23.37,17.97,23.37,6.44,10.89]
[2019,11,3,3,43772.124999999876,3.21,"Valid",10.47,14.98,"Valid",22.84,null,null,3.21,10.47,14.98,22.84,14.98,22.84,3.21,10.47]
[2019,11,3,4,43772.166666666541,7.18,"Valid",10.25,15.87,"Valid",22.48,null,null,7.18,10.25,15.87,22.48,15.87,22.48,7.18,10.25]
[2019,11,3,5,43772.208333333205,6.08,"Valid",10.09,14.8,"Valid",22.36,null,null,6.08,10.09,14.8,22.36,14.8,22.36,6.08,10.09]
[2019,11,3,6,43772.249999999869,9.65,"Valid",10.09,18.73,"Valid",22.35,null,null,9.65,10.09,18.73,22.35,18.73,22.35,9.65,10.09]
[2019,11,3,7,43772.291666666533,8.16,"Valid",10.08,19.28,"Valid",22.43,null,null,8.16,10.08,19.28,22.43,19.28,22.43,8.16,10.08]
[2019,11,3,8,43772.333333333198,3.48,"Valid",9.89,15.2,"Valid",22.3,null,null,3.48,9.89,15.2,22.3,15.2,22.3,3.48,9.89]
[2019,11,3,9,43772.374999999862,4.8899999999999997,"Valid",9.82,15.64,"Valid",22.38,null,null,4.8899999999999997,9.82,15.64,22.38,15.64,22.38,4.8899999999999997,9.82]
[2019,11,3,10,43772.416666666526,5.49,"Valid",9.52,16.98,"Valid",22.27,null,null,5.49,9.52,16.98,22.27,16.98,22.27,5.49,9.52]
[2019,11,3,11,43772.45833333319,6.8,"Valid",9.2200000000000006,32,"Valid",22.61,null,null,6.8,9.2200000000000006,32,22.61,32,22.61,6.8,9.2200000000000006]
[2019,11,3,12,43772.499999999854,5.67,"Valid",8.74,28.27,"Valid",22.64,null,null,5.67,8.74,28.27,22.64,28.27,22.64,5.67,8.74]
[2019,11,3,13,43772.541666666519,9.5500000000000007,"Valid",8.68,87.77,"Valid",25.37,null,null,9.5500000000000007,8.68,87.77,25.37,87.77,25.37,9.5500000000000007,8.68]
[2019,11,3,14,43772.583333333183,12.34,"Valid",8.6300000000000008,47.66,"Valid",26.42,null,null,12.34,8.6300000000000008,47.66,26.42,47.66,26.42,12.34,8.6300000000000008]
[2019,11,3,15,43772.624999999847,6.89,"Valid",8.42,33.86,"Valid",26.89,null,null,6.89,8.42,33.86,26.89,33.86,26.89,6.89,8.42]
[2019,11,3,16,43772.666666666511,12.99,"Valid",8.33,109.8,"Valid",30.29,null,null,{"$f":"IF(G66=\"Valid\", F66, NA())","v":12.99},{"$f":"IF(G66=\"Valid\", H66, NA())","v":8.33},{"$f":"IF(J66=\"Valid\", I66, NA())","v":109.8},{"$f":"IF(J66=\"Valid\", K66, NA())","v":30.29},109.8,30.29,12.99,8.33]
[2019,11,3,17,43772.708333333176,3.84,"Valid",7.84,56.45,"Valid",31.31,null,null,3.84,7.84,56.45,31.31,56.45,31.31,3.84,7.84]
[{"$f":"A67","v":2019},11,3,{"$f":"IF(D67=23,0,D67+1)","v":18},{"$f":"E67+0.0416666666666666","v":43772.74999999984},5.43,"Valid",7.53,24.59,"Valid",30.97,null,null,5.43,7.53,24.59,30.97,24.59,30.97,5.43,7.53]
[2019,11,3,19,43772.791666666504,5.29,"Valid",7.15,15.68,"Valid",30.15,null,null,5.29,7.15,15.68,30.15,15.68,30.15,5.29,7.15]
[2019,11,3,20,43772.833333333168,1.39,"Valid",6.32,8.3000000000000007,"Valid",28.78,null,null,1.39,6.32,8.3000000000000007,28.78,8.3000000000000007,28.78,1.39,6.32]
[2019,11,3,21,43772.874999999833,1.73,"Valid",5.85,6.62,"Valid",27.62,null,null,1.73,5.85,6.62,27.62,6.62,27.62,1.73,5.85]
[2019,11,3,22,43772.916666666497,5.57,"Valid",5.9,9.74,"Valid",27.32,null,null,5.57,5.9,9.74,27.32,9.74,27.32,5.57,5.9]
[2019,11,3,23,43772.958333333161,4.21,"Valid",5.85,7.15,"Valid",26.92,null,null,4.21,5.85,7.15,26.92,7.15,26.92,4.21,5.85]
[2019,11,4,0,43772.999999999825,10.82,"Valid",6.13,14.01,"Valid",26.84,null,null,10.82,6.13,14.01,26.84,14.01,26.84,10.82,6.13]
[2019,11,4,1,43773.04166666649,4.91,"Valid",6.33,9.5299999999999994,"Valid",26.7,null,null,4.91,6.33,9.5299999999999994,26.7,9.5299999999999994,26.7,4.91,6.33]
[2019,11,4,2,43773.083333333154,4.38,"Valid",6.25,8.23,"Valid",26.3,null,null,4.38,6.25,8.23,26.3,8.23,26.3,4.38,6.25]
[2019,11,4,3,43773.124999999818,4.96,"Valid",6.32,8.4,"Valid",26.02,null,null,4.96,6.32,8.4,26.02,8.4,26.02,4.96,6.32]
[2019,11,4,4,43773.166666666482,0.91,"Valid",6.06,3,"Valid",25.49,null,null,0.91,6.06,3,25.49,3,25.49,0.91,6.06]
[2019,11,4,5,43773.208333333147,{"$f":"NA()","v":{"$error":"#N/A"}},"Invalid",{"$f":"NA()","v":{"$error":"#N/A"}},{"$f":"NA()","v":{"$error":"#N/A"}},"Invalid",{"$f":"-NA()","v":{"$error":"#N/A"}},"Pump Failure","High negative removed",{"$error":"#N/A"},{"$error":"#N/A"},{"$error":"#N/A"},{"$error":"#N/A"}]
[2019,11,4,6,43773.249999999811,2.08,"Valid",5.73,4.01,"Valid",24.25,null,null,2.08,5.73,4.01,24.25,4.01,24.25,2.08,5.73]
[2019,11,4,7,43773.291666666475,2.37,"Valid",5.48,4.32,"Valid",23.62,null,null,2.37,5.48,4.32,23.62,4.32,23.62,2.37,5.48]
[2019,11,4,8,43773.333333333139,5.14,"Valid",5.55,7.3,"Valid",23.29,null,null,5.14,5.55,7.3,23.29,7.3,23.29,5.14,5.55]
[2019,11,4,9,43773.374999999804,3.63,"Valid",5.5,5.78,"Valid",22.88,null,null,3.63,5.5,5.78,22.88,5.78,22.88,3.63,5.5]
[2019,11,4,10,43773.416666666468,1.28,"Valid",5.31,3.23,"Valid",22.31,null,null,1.28,5.31,3.23,22.31,3.23,22.31,1.28,5.31]
[2019,11,4,11,43773.458333333132,1.63,"Valid",5.09,1.74,"Valid",21.05,null,null,1.63,5.09,1.74,21.05,1.74,21.05,1.63,5.09]
[2019,11,4,12,43773.499999999796,-1.72,"Valid",4.7699999999999996,0.73,"Valid",19.899999999999999,null,null,-1.72,4.7699999999999996,0.73,19.899999999999999,0.73,19.899999999999999,-1.72,4.7699999999999996]
[2019,11,4,13,43773.541666666461,5.39,"Valid",4.59,9.41,"Valid",16.64,null,null,5.39,4.59,9.41,16.64,9.41,16.64,5.39,4.59]
[2019,11,4,14,43773.583333333125,5.79,"Valid",4.3,8.11,"Valid",14.99,null,null,5.79,4.3,8.11,14.99,8.11,14.99,5.79,4.3]
[2019,11,4,15,43773.624999999789,9.4,"Valid",4.41,12.49,"Valid",14.1,null,null,9.4,4.41,12.49,14.1,12.49,14.1,9.4,4.41]
[2019,11,4,16,43773.666666666453,9.73,"Valid",4.2699999999999996,11.6,"Valid",10.01,null,null,9.73,4.2699999999999996,11.6,10.01,11.6,10.01,9.73,4.2699999999999996]
[2019,{"$f":"B90","v":11},{"$f":"C67+1","v":4},17,43773.708333333117,6.92,"Valid",4.4000000000000004,10.84,"Valid",8.11,null,null,6.92,4.4000000000000004,10.84,8.11,10.84,8.11,6.92,4.4000000000000004]
[2019,11,4,18,43773.749999999782,6.62,"Valid",4.45,7.07,"Valid",7.38,null,null,6.62,4.45,7.07,7.38,7.07,7.38,6.62,4.45]
[2019,11,4,19,43773.791666666446,5.61,"Valid",4.47,7,"Valid",7.01,null,null,5.61,4.47,7,7.01,7,7.01,5.61,4.47]
[2019,11,4,20,43773.83333333311,7.56,"Valid",4.74,11.62,"Valid",7.15,null,null,7.56,4.74,11.62,7.15,11.62,7.15,7.56,4.74]
[2019,11,4,21,43773.874999999774,4.8600000000000003,"Valid",4.87,8.18,"Valid",7.22,null,null,4.8600000000000003,4.87,8.18,7.22,8.18,7.22,4.8600000000000003,4.87]
[2019,11,4,22,43773.916666666439,1.19,"Valid",4.68,4.78,"Valid",7.01,null,null,1.19,4.68,4.78,7.01,4.78,7.01,1.19,4.68]
[2019,11,4,23,43773.958333333103,2.2999999999999998,"Valid",4.5999999999999996,5.34,"Valid",6.94,null,null,2.2999999999999998,4.5999999999999996,5.34,6.94,5.34,6.94,2.2999999999999998,4.5999999999999996]
[2019,11,5,0,43773.999999999767,6.39,"Valid",4.41,9.85,"Valid",6.76,null,null,6.39,4.41,9.85,6.76,9.85,6.76,6.39,4.41]
[2019,11,5,1,43774.041666666431,1.9,"Valid",4.2699999999999996,4.95,"Valid",6.57,null,null,1.9,4.2699999999999996,4.95,6.57,4.95,6.57,1.9,4.2699999999999996]
[2019,11,5,2,43774.083333333096,4.57,"Valid",4.28,6.61,"Valid",6.5,null,null,4.57,4.28,6.61,6.5,6.61,6.5,4.57,4.28]
[2019,11,5,3,43774.12499999976,3.48,"Valid",4.22,6.25,"Valid",6.41,null,null,3.48,4.22,6.25,6.41,6.25,6.41,3.48,4.22]
[2019,11,5,4,43774.166666666424,3.59,"Valid",4.34,6.6,"Valid",6.56,null,null,3.59,4.34,6.6,6.56,6.6,6.56,3.59,4.34]
[2019,11,5,5,43774.208333333088,-1.88,"Valid",4.08,10.38,"Valid",7.01,null,null,-1.88,4.08,10.38,7.01,10.38,7.01,-1.88,4.08]
[2019,11,5,6,43774.249999999753,-0.51,"Valid",3.97,29.31,"Valid",8.06,null,null,-0.51,3.97,29.31,8.06,29.31,8.06,-0.51,3.97]
[2019,11,5,7,43774.291666666417,1.54,"Valid",3.93,17.690000000000001,"Valid",8.6199999999999992,null,null,1.54,3.93,17.690000000000001,8.6199999999999992,17.690000000000001,8.6199999999999992,1.54,3.93]
[2019,11,5,8,43774.333333333081,6.43,"Valid",3.99,17.28,"Valid",9.0399999999999991,null,null,6.43,3.99,17.28,9.0399999999999991,17.28,9.0399999999999991,6.43,3.99]
[2019,11,5,9,43774.374999999745,1.9,"Valid",3.92,6.02,"Valid",9.0500000000000007,null,null,1.9,3.92,6.02,9.0500000000000007,6.02,9.0500000000000007,1.9,3.92]
[2019,11,5,10,43774.41666666641,5.27,"Valid",4.08,11.13,"Valid",9.3699999999999992,null,null,5.27,4.08,11.13,9.3699999999999992,11.13,9.3699999999999992,5.27,4.08]
[2019,11,5,11,43774.458333333074,-2.13,"Valid",3.93,-1.82,"Valid",9.23,null,null,-2.13,3.93,-1.82,9.23,-1.82,9.23,-2.13,3.93]
[2019,11,5,12,43774.499999999738,-2.2799999999999998,"Valid",3.9,-8.99,"Valid",8.82,null,null,-2.2799999999999998,3.9,-8.99,8.82,-8.99,8.82,-2.2799999999999998,3.9]
[2019,11,5,13,43774.541666666402,{"$f":"NA()","v":{"$error":"#N/A"}},"Invalid",{"$f":"NA()","v":{"$error":"#N/A"}},{"$f":"NA()","v":{"$error":"#N/A"}},"Invalid",{"$f":"NA()","v":{"$error":"#N/A"}},"Pump Failure","High negative removed",{"$error":"#N/A"},{"$error":"#N/A"},{"$error":"#N/A"},{"$error":"#N/A"}]
[2019,11,5,14,43774.583333333067,5.87,"Valid",3.84,10.07,"Valid",7.85,null,null,5.87,3.84,10.07,7.85,10.07,7.85,5.87,3.84]
[2019,11,5,15,43774.624999999731,3.83,"Valid",3.6,6.35,"Valid",7.59,null,null,3.83,3.6,6.35,7.59,6.35,7.59,3.83,3.6]
[2019,11,5,16,43774.666666666395,5.84,"Valid",3.43,10.99,"Valid",7.57,null,null,5.84,3.43,10.99,7.57,10.99,7.57,5.84,3.43]
[2019,11,5,17,43774.708333333059,{"$f":"NA()","v":{"$error":"#N/A"}},"Invalid",{"$f":"NA()","v":{"$error":"#N/A"}},{"$f":"NA()","v":{"$error":"#N/A"}},"Invalid",{"$f":"NA()","v":{"$error":"#N/A"}},"Pump Failure","High negative removed",{"$error":"#N/A"},{"$error":"#N/A"},{"$error":"#N/A"},{"$error":"#N/A"}]
[2019,11,5,18,43774.749999999724,3.81,"Valid",3.14,5.19,"Valid",7.12,null,null,3.81,3.14,5.19,7.12,5.19,7.12,3.81,3.14]
[2019,11,5,19,43774.791666666388,-0.46,"Valid",2.87,3.66,"Valid",6.98,null,null,-0.46,2.87,3.66,6.98,3.66,6.98,-0.46,2.87]
[2019,11,5,20,43774.833333333052,7.73,"Valid",2.87,10.32,"Valid",6.92,null,null,7.73,2.87,10.32,6.92,10.32,6.92,7.73,2.87]
[2019,11,5,21,43774.874999999716,0.08,"Valid",2.66,3.09,"Valid",6.71,null,null,0.08,2.66,3.09,6.71,3.09,6.71,0.08,2.66]
[2019,11,5,22,43774.91666666638,2.93,"Valid",2.74,7.38,"Valid",6.82,null,null,2.93,2.74,7.38,6.82,7.38,6.82,2.93,2.74]
{"$rows_left_out":626}
{"sheet":"Raw data_format","index":4,"n_rows":8,"n_cols":6,"rows_kept":8,"cut":false,"hidden":false,"merged":[]}
["Parameter","Format","Comment","Units of measure","Minimum","Maximum"]
["Year","yyyy","4 integer format","Not applicable",2015,"Until reporting ceases"]
["Month","mm","2 integer format","Not applicable",1,12]
["Day","dd","2 integer format","Not applicable",1,31]
["Hour","hh","2 integer format","Not applicable",0,23]
["PM10",0,"1 decimal place resolution","µg/m3","Negative","Instrument specific"]
["PM2.5",0,"2 decimal place resolution","µg/m3","Negative","Instrument specific"]
["Status","Text","7 character format","Not applicable","Valid","Invalid"]