{"text_format":"1","workbook":"xlsx","n_sheets":7,"sheets":["Instructions","Meta data_sheet","Meta data_lookup","Raw data_sheet","Raw data_format","24hr_PM10_chart","24hr_PM2.5_chart"],"not_rendered":{"charts":4,"images":0,"macros":1,"external_links":0,"defined_names":10,"comments":0,"pivot_tables":0},"unopened":[{"sheet":"24hr_PM10_chart","index":5,"reason":"not_a_worksheet"},{"sheet":"24hr_PM2.5_chart","index":6,"reason":"not_a_worksheet"}],"bounds":{"document_bytes":16777216,"sheet_cells":100000,"rows_first":2000,"rows_last":500,"rows_between":2000,"halvings":0,"cell_chars":16384,"cell_head_chars":4096},"cells_cut":0,"cells_raw":0,"read":"whole","date_system":"1900"}

{"sheet":"Instructions","index":0,"n_rows":0,"n_cols":0,"rows_kept":0,"cut":false,"hidden":false,"merged":[]}

{"sheet":"Meta data_sheet","index":1,"n_rows":17,"n_cols":5,"rows_kept":17,"cut":false,"hidden":false,"merged":[[18,0,18,1],[16,0,16,1]]}
["Ambient Monitoring Station","Details",null,"Ambient Monitoring Results","Details"]
["Location","Breeza",null,"PM2.5 monitoring start (dd/mm/yyyy hh:mm)","2019-10-01"]
["Easting",{"$f":"VLOOKUP($B$2,'Meta data_lookup'!$A$2:$D$5,2,FALSE)","v":237993},null,"PM2.5 monitoring end","2019-11-01"]
["Northing",{"$f":"VLOOKUP($B$2,'Meta data_lookup'!$A$2:$D$5,3,FALSE)","v":6542606},null,"PM2.5 monitoring period (h)",{"$f":"(E3-E2)*24","v":744}]
["Site elevation (m)",{"$f":"VLOOKUP($B$2,'Meta data_lookup'!$A$2:$D$5,4,FALSE)","v":"ND"},null,"Number of valid PM2.5 results",{"$f":"COUNTIF('Raw data_sheet'!G2:G745,\"Valid\")","v":709}]
["Description of surrounding land use","Agriculture",null,"Proportion of valid PM2.5 results (%)",{"$f":"E5/E4","v":0.95295698924731187}]
["Typical sources impacting on the site","Agriculture/Gravel roads",null,"PM10 monitoring start (dd/mm/yyyy hh:mm)","2019-10-01"]
["Site compliance with AS/NZS 3580.1.1:2007","Yes",null,"PM10 monitoring end","2019-11-01"]
["PM2.5 method compliance with AS/NZS 3580.9.13:2013\n","Yes",null,"PM10 monitoring period (h)",{"$f":"(E8-E7)*24","v":744}]
["PM2.5 instrument make","Thermo",null,"Number of valid PM10 results",{"$f":"COUNTIF('Raw data_sheet'!J2:J745,\"Valid\")","v":709}]
["PM2.5 instrument model","1405DF",null,"Proportion of valid PM10 results (%)",{"$f":"E10/E9","v":0.95295698924731187}]
["PM2.5 instrument intake height (m)",3.5]
["PM10 method compliance with AS 3580.9.8-2008\n","No*"]
["PM10 instrument make","Thermo"]
["PM10 instrument model","1405DF"]
["PM10 instrument intake height (m)",3.5]
["*The 1405DF TEOM used at this site measures PM10 indirectly rather than directly. The unit does however meet the intent of AS 3580.9.8-2008, and this method has been accredited by the USEPA. It is considered scientifically robust and is used extensively throughout NSW with EPA's knowledge and informal acceptance."]

{"sheet":"Meta data_lookup","index":2,"n_rows":5,"n_cols":4,"rows_kept":5,"cut":false,"hidden":false,"merged":[]}
["Location","Easting","Northing","Site elevation (m)"]
["Maules Creek",225302,6623037,"ND"]
["Breeza",237993,6542606,"ND"]
["Will-gai",231804,6596392,"ND"]
["Werris Creek",276783,6528734,"ND"]

{"sheet":"Raw data_sheet","index":3,"n_rows":745,"n_cols":21,"rows_kept":745,"cut":false,"hidden":false,"merged":[]}
["Year","Month","Day","Hour","Date and time","PM2.5_hourly","PM2.5_Data_Status","PM2.5_24hr_rolling_average","PM10_hourly","PM10_Data_Status","PM10_24hr_rolling_average","Cause of data invalidity, if applicable","Detailed comments","PM2.5_hourly_valid_plot","PM2.5_24hr_rolling_ave_valid_plot","PM10_hourly_valid_plot","PM10_24hr_rolling_ave_valid_plot","PM10_hourly_valid_plot_series","PM10_24hr_rolling_average_valid_plot_series","PM2.5_hourly_valid_plot_series","PM2.5_24hr_rolling_average_valid_plot_series"]
[2019,10,1,0,{"$f":"DATE(A2,B2,C2)+TIME(D2,0,0)","v":43739},2.91,"Valid",6.51,7.17,"Valid",19.18,null,null,{"$f":"IF(G2=\"Valid\", F2, NA())","v":2.91},{"$f":"IF(G2=\"Valid\", H2, NA())","v":6.51},{"$f":"IF(J2=\"Valid\", I2, NA())","v":7.17},{"$f":"IF(J2=\"Valid\", K2, NA())","v":19.18},7.17,19.18,2.91,6.51]
[{"$f":"A2","v":2019},{"$f":"B2","v":10},{"$f":"C2","v":1},{"$f":"IF(D2=23,0,D2+1)","v":1},{"$f":"E2+0.0416666666666666","v":43739.041666666664},3.71,"Valid",6.62,8.61,"Valid",18.91,null,null,3.71,6.62,8.61,18.91,8.61,18.91,3.71,6.62]
[{"$f":"A3","v":2019},{"$f":"B3","v":10},1,{"$f":"IF(D3=23,0,D3+1)","v":2},{"$f":"E3+0.0416666666666666","v":43739.083333333328},4.67,"Valid",6.58,8.67,"Valid",18.47,null,null,4.67,6.58,8.67,18.47,8.67,18.47,4.67,6.58]
[2019,10,1,3,43739.124999999993,-1.68,"Valid",6.34,2.4300000000000002,"Valid",17.760000000000002,null,null,-1.68,6.34,2.4300000000000002,17.760000000000002,2.4300000000000002,17.760000000000002,-1.68,6.34]
[2019,10,1,4,43739.166666666657,0.72,"Valid",6.12,5.05,"Valid",16.93,null,null,0.72,6.12,5.05,16.93,5.05,16.93,0.72,6.12]
[2019,10,1,5,43739.208333333321,5.5,"Valid",6.25,9.1300000000000008,"Valid",16.670000000000002,null,null,5.5,6.25,9.1300000000000008,16.670000000000002,9.1300000000000008,16.670000000000002,5.5,6.25]
[2019,10,1,6,43739.249999999985,2.0699999999999998,"Valid",6.29,6.01,"Valid",16.34,null,null,2.0699999999999998,6.29,6.01,16.34,6.01,16.34,2.0699999999999998,6.29]
[2019,10,1,7,43739.29166666665,5.1100000000000003,"Valid",6.3,7.69,"Valid",15.88,null,null,5.1100000000000003,6.3,7.69,15.88,7.69,15.88,5.1100000000000003,6.3]
[2019,10,1,8,43739.333333333314,4.05,"Valid",6.19,8.1300000000000008,"Valid",15.24,null,null,4.05,6.19,8.1300000000000008,15.24,8.1300000000000008,15.24,4.05,6.19]
[2019,10,1,9,43739.374999999978,1.43,"Valid",5.9,5.81,"Valid",14.3,null,null,1.43,5.9,5.81,14.3,5.81,14.3,1.43,5.9]
[2019,10,1,10,43739.416666666642,1.1200000000000001,"Valid",5.58,5.5,"Valid",13.57,null,null,1.1200000000000001,5.58,5.5,13.57,5.5,13.57,1.1200000000000001,5.58]
[2019,10,1,11,43739.458333333307,6.22,"Valid",5.41,9.94,"Valid",12.91,null,null,6.22,5.41,9.94,12.91,9.94,12.91,6.22,5.41]
[2019,10,1,12,43739.499999999971,7.42,"Valid",5.41,13.69,"Valid",12.69,null,null,7.42,5.41,13.69,12.69,13.69,12.69,7.42,5.41]
[2019,10,1,13,43739.541666666635,5.37,"Valid",5.3,12.83,"Valid",12.43,null,null,5.37,5.3,12.83,12.43,12.83,12.43,5.37,5.3]
[2019,10,1,14,43739.583333333299,7.18,"Valid",5.14,14.57,"Valid",12.14,null,null,7.18,5.14,14.57,12.14,14.57,12.14,7.18,5.14]
[2019,10,1,15,43739.624999999964,8.73,"Valid",5.0599999999999996,14.53,"Valid",11.79,null,null,8.73,5.0599999999999996,14.53,11.79,14.53,11.79,8.73,5.0599999999999996]
[2019,10,1,16,43739.666666666628,7.49,"Valid",5.1100000000000003,12.61,"Valid",11.64,null,null,7.49,5.1100000000000003,12.61,11.64,12.61,11.64,7.49,5.1100000000000003]
[2019,10,1,17,43739.708333333292,4.12,"Valid",5.04,10.63,"Valid",11.4,null,null,4.12,5.04,10.63,11.4,10.63,11.4,4.12,5.04]
[2019,10,1,18,43739.749999999956,8.65,"Valid",4.96,12.95,"Valid",11.01,null,null,8.65,4.96,12.95,11.01,12.95,11.01,8.65,4.96]
[2019,10,1,19,43739.791666666621,7.12,"Valid",4.8600000000000003,12.63,"Valid",10.52,null,null,7.12,4.8600000000000003,12.63,10.52,12.63,10.52,7.12,4.8600000000000003]
[2019,10,1,20,43739.833333333285,6.45,"Valid",4.79,20.57,"Valid",10.5,null,null,6.45,4.79,20.57,10.5,20.57,10.5,6.45,4.79]
[2019,10,1,21,43739.874999999949,3.05,"Valid",4.6900000000000004,13.44,"Valid",10.39,null,null,3.05,4.6900000000000004,13.44,10.39,13.44,10.39,3.05,4.6900000000000004]
[2019,10,1,22,43739.916666666613,5.59,"Valid",4.62,14.06,"Valid",10.35,null,null,5.59,4.62,14.06,10.35,14.06,10.35,5.59,4.62]
[2019,{"$f":"B24","v":10},{"$f":"C24","v":1},23,43739.958333333278,7.38,"Valid",4.7699999999999996,16.57,"Valid",10.55,null,null,7.38,4.7699999999999996,16.57,10.55,16.57,10.55,7.38,4.7699999999999996]
[2019,{"$f":"B25","v":10},{"$f":"C2+1","v":2},0,43739.999999999942,6.43,"Valid",4.91,13.38,"Valid",10.81,null,null,6.43,4.91,13.38,10.81,13.38,10.81,6.43,4.91]
[2019,{"$f":"B26","v":10},{"$f":"C3+1","v":2},1,43740.041666666606,7.85,"Valid",5.09,15.37,"Valid",11.09,null,null,7.85,5.09,15.37,11.09,15.37,11.09,7.85,5.09]
[2019,10,2,2,43740.08333333327,4.71,"Valid",5.09,11.53,"Valid",11.21,null,null,4.71,5.09,11.53,11.21,11.53,11.21,4.71,5.09]
[2019,10,2,3,43740.124999999935,3.59,"Valid",5.31,11.31,"Valid",11.58,null,null,3.59,5.31,11.31,11.58,11.31,11.58,3.59,5.31]
[2019,10,2,4,43740.166666666599,5.8,"Valid",5.52,11.28,"Valid",11.84,null,null,5.8,5.52,11.28,11.84,11.28,11.84,5.8,5.52]
[2019,10,2,5,43740.208333333263,3.76,"Valid",5.45,7.97,"Valid",11.79,null,null,3.76,5.45,7.97,11.79,7.97,11.79,3.76,5.45]
[2019,10,2,6,43740.249999999927,5.94,"Valid",5.61,10.98,"Valid",12,null,null,5.94,5.61,10.98,12,10.98,12,5.94,5.61]
[2019,10,2,7,43740.291666666591,0.71,"Valid",5.42,10.039999999999999,"Valid",12.1,null,null,0.71,5.42,10.039999999999999,12.1,10.039999999999999,12.1,0.71,5.42]
[2019,10,2,8,43740.333333333256,5.05,"Valid",5.47,17.59,"Valid",12.49,null,null,5.05,5.47,17.59,12.49,17.59,12.49,5.05,5.47]
[2019,10,2,9,43740.37499999992,5.85,"Valid",5.65,14.76,"Valid",12.86,null,null,5.85,5.65,14.76,12.86,14.76,12.86,5.85,5.65]
[2019,10,2,10,43740.416666666584,9.85,"Valid",6.01,20.32,"Valid",13.48,null,null,9.85,6.01,20.32,13.48,20.32,13.48,9.85,6.01]
[2019,10,2,11,43740.458333333248,11.08,"Valid",6.22,19.989999999999998,"Valid",13.9,null,null,11.08,6.22,19.989999999999998,13.9,19.989999999999998,13.9,11.08,6.22]
[2019,10,2,12,43740.499999999913,11.92,"Valid",6.4,21.28,"Valid",14.22,null,null,11.92,6.4,21.28,14.22,21.28,14.22,11.92,6.4]
[2019,10,2,13,43740.541666666577,7.88,"Valid",6.51,15.98,"Valid",14.35,null,null,7.88,6.51,15.98,14.35,15.98,14.35,7.88,6.51]
[2019,10,2,14,43740.583333333241,6.73,"Valid",6.49,12.76,"Valid",14.27,null,null,6.73,6.49,12.76,14.27,12.76,14.27,6.73,6.49]
[2019,10,2,15,43740.624999999905,6.08,"Valid",6.38,12.61,"Valid",14.19,null,null,6.08,6.38,12.61,14.19,12.61,14.19,6.08,6.38]
[2019,10,2,16,43740.66666666657,7.53,"Valid",6.38,13.51,"Valid",14.23,null,null,7.53,6.38,13.51,14.23,13.51,14.23,7.53,6.38]
[2019,10,2,17,43740.708333333234,7.57,"Valid",6.52,13.95,"Valid",14.37,null,null,7.57,6.52,13.95,14.37,13.95,14.37,7.57,6.52]
[2019,10,2,18,43740.749999999898,5.57,"Valid",6.4,11.96,"Valid",14.33,null,null,5.57,6.4,11.96,14.33,11.96,14.33,5.57,6.4]
[2019,10,2,19,43740.791666666562,6.44,"Valid",6.37,19.010000000000002,"Valid",14.59,null,null,6.44,6.37,19.010000000000002,14.59,19.010000000000002,14.59,6.44,6.37]
[2019,10,2,20,43740.833333333227,7.04,"Valid",6.39,22.12,"Valid",14.66,null,null,7.04,6.39,22.12,14.66,22.12,14.66,7.04,6.39]
[2019,10,2,21,43740.874999999891,8.07,"Valid",6.6,18.11,"Valid",14.85,null,null,8.07,6.6,18.11,14.85,18.11,14.85,8.07,6.6]
[2019,10,2,22,43740.916666666555,8.67,"Valid",6.73,22.21,"Valid",15.19,null,null,8.67,6.73,22.21,15.19,22.21,15.19,8.67,6.73]
[2019,10,2,23,43740.958333333219,3.24,"Valid",6.56,18.77,"Valid",15.28,null,null,3.24,6.56,18.77,15.28,18.77,15.28,3.24,6.56]
[2019,10,3,0,43740.999999999884,3.24,"Valid",6.42,15.13,"Valid",15.36,null,null,3.24,6.42,15.13,15.36,15.13,15.36,3.24,6.42]
[2019,10,3,1,43741.041666666548,4.72,"Valid",6.29,18.97,"Valid",15.51,null,null,4.72,6.29,18.97,15.51,18.97,15.51,4.72,6.29]
[2019,10,3,2,43741.083333333212,7.49,"Valid",6.41,20.399999999999999,"Valid",15.88,null,null,7.49,6.41,20.399999999999999,15.88,20.399999999999999,15.88,7.49,6.41]
[2019,10,3,3,43741.124999999876,5.92,"Valid",6.51,19.21,"Valid",16.2,null,null,5.92,6.51,19.21,16.2,19.21,16.2,5.92,6.51]
[2019,10,3,4,43741.166666666541,4.7,"Valid",6.46,20.67,"Valid",16.600000000000001,null,null,4.7,6.46,20.67,16.600000000000001,20.67,16.600000000000001,4.7,6.46]
[2019,10,3,5,43741.208333333205,9.51,"Valid",6.7,23.26,"Valid",17.23,null,null,9.51,6.7,23.26,17.23,23.26,17.23,9.51,6.7]
[2019,10,3,6,43741.249999999869,4.17,"Valid",6.63,18.72,"Valid",17.559999999999999,null,null,4.17,6.63,18.72,17.559999999999999,18.72,17.559999999999999,4.17,6.63]
[2019,10,3,7,43741.291666666533,6.23,"Valid",6.86,24.86,"Valid",18.170000000000002,null,null,6.23,6.86,24.86,18.170000000000002,24.86,18.170000000000002,6.23,6.86]
[2019,10,3,8,43741.333333333198,10.53,"Valid",7.08,31.15,"Valid",18.739999999999998,null,null,10.53,7.08,31.15,18.739999999999998,31.15,18.739999999999998,10.53,7.08]
[2019,10,3,9,43741.374999999862,9.6999999999999993,"Valid",7.25,26.19,"Valid",19.21,null,null,9.6999999999999993,7.25,26.19,19.21,26.19,19.21,9.6999999999999993,7.25]
[2019,10,3,10,43741.416666666526,10.06,"Valid",7.25,23.52,"Valid",19.350000000000001,null,null,10.06,7.25,23.52,19.350000000000001,23.52,19.350000000000001,10.06,7.25]
[2019,10,3,11,43741.45833333319,11.86,"Valid",7.29,24.69,"Valid",19.54,null,null,11.86,7.29,24.69,19.54,24.69,19.54,11.86,7.29]
[2019,10,3,12,43741.499999999854,6.59,"Valid",7.06,18.760000000000002,"Valid",19.440000000000001,null,null,6.59,7.06,18.760000000000002,19.440000000000001,18.760000000000002,19.440000000000001,6.59,7.06]
[2019,10,3,13,43741.541666666519,4.8499999999999996,"Valid",6.94,15.92,"Valid",19.440000000000001,null,null,4.8499999999999996,6.94,15.92,19.440000000000001,15.92,19.440000000000001,4.8499999999999996,6.94]
[2019,10,3,14,43741.583333333183,3.27,"Valid",6.79,13.64,"Valid",19.47,null,null,3.27,6.79,13.64,19.47,13.64,19.47,3.27,6.79]
[2019,10,3,15,43741.624999999847,9.7200000000000006,"Valid",6.95,20.14,"Valid",19.79,null,null,9.7200000000000006,6.95,20.14,19.79,20.14,19.79,9.7200000000000006,6.95]
[2019,10,3,16,43741.666666666511,6.93,"Valid",6.92,16.72,"Valid",19.920000000000002,null,null,{"$f":"IF(G66=\"Valid\", F66, NA())","v":6.93},{"$f":"IF(G66=\"Valid\", H66, NA())","v":6.92},{"$f":"IF(J66=\"Valid\", I66, NA())","v":16.72},{"$f":"IF(J66=\"Valid\", K66, NA())","v":19.920000000000002},16.72,19.920000000000002,6.93,6.92]
[2019,10,3,17,43741.708333333176,8.7799999999999994,"Valid",6.97,19.04,"Valid",20.13,null,null,8.7799999999999994,6.97,19.04,20.13,19.04,20.13,8.7799999999999994,6.97]
[{"$f":"A67","v":2019},10,3,{"$f":"IF(D67=23,0,D67+1)","v":18},{"$f":"E67+0.0416666666666666","v":43741.74999999984},8.43,"Valid",7.09,27.52,"Valid",20.78,null,null,8.43,7.09,27.52,20.78,27.52,20.78,8.43,7.09]
[2019,10,3,19,43741.791666666504,5.33,"Valid",7.04,27.99,"Valid",21.15,null,null,5.33,7.04,27.99,21.15,27.99,21.15,5.33,7.04]
[2019,10,3,20,43741.833333333168,6.83,"Valid",7.04,23.4,"Valid",21.21,null,null,6.83,7.04,23.4,21.21,23.4,21.21,6.83,7.04]
[2019,10,3,21,43741.874999999833,4.95,"Valid",6.91,15.96,"Valid",21.12,null,null,4.95,6.91,15.96,21.12,15.96,21.12,4.95,6.91]
[2019,10,3,22,43741.916666666497,5.37,"Valid",6.77,17.829999999999998,"Valid",20.94,null,null,5.37,6.77,17.829999999999998,20.94,17.829999999999998,20.94,5.37,6.77]
[2019,10,3,23,43741.958333333161,7.74,"Valid",6.96,22.94,"Valid",21.11,null,null,7.74,6.96,22.94,21.11,22.94,21.11,7.74,6.96]
[2019,10,4,0,43741.999999999825,10.09,"Valid",7.24,26.31,"Valid",21.58,null,null,10.09,7.24,26.31,21.58,26.31,21.58,10.09,7.24]
[2019,10,4,1,43742.04166666649,4.54,"Valid",7.23,21.94,"Valid",21.7,null,null,4.54,7.23,21.94,21.7,21.94,21.7,4.54,7.23]
[2019,10,4,2,43742.083333333154,6.87,"Valid",7.21,27.92,"Valid",22.01,null,null,6.87,7.21,27.92,22.01,27.92,22.01,6.87,7.21]
[2019,10,4,3,43742.124999999818,4.9000000000000004,"Valid",7.16,20.38,"Valid",22.06,null,null,4.9000000000000004,7.16,20.38,22.06,20.38,22.06,4.9000000000000004,7.16]
[2019,10,4,4,43742.166666666482,6.7,"Valid",7.25,19.98,"Valid",22.03,null,null,6.7,7.25,19.98,22.03,19.98,22.03,6.7,7.25]
[2019,10,4,5,43742.208333333147,13.48,"Valid",7.41,30.03,"Valid",22.31,null,null,13.48,7.41,30.03,22.31,30.03,22.31,13.48,7.41]
[2019,10,4,6,43742.249999999811,9.11,"Valid",7.62,32.380000000000003,"Valid",22.88,null,null,9.11,7.62,32.380000000000003,22.88,32.380000000000003,22.88,9.11,7.62]
[2019,10,4,7,43742.291666666475,9.27,"Valid",7.75,24.9,"Valid",22.89,null,null,9.27,7.75,24.9,22.89,24.9,22.89,9.27,7.75]
[2019,10,4,8,43742.333333333139,8.6999999999999993,"Valid",7.67,26.42,"Valid",22.69,null,null,8.6999999999999993,7.67,26.42,22.69,26.42,22.69,8.6999999999999993,7.67]
[2019,10,4,9,43742.374999999804,9.2200000000000006,"Valid",7.65,25.66,"Valid",22.67,null,null,9.2200000000000006,7.65,25.66,22.67,25.66,22.67,9.2200000000000006,7.65]
[2019,10,4,10,43742.416666666468,8.2200000000000006,"Valid",7.57,27.5,"Valid",22.83,null,null,8.2200000000000006,7.57,27.5,22.83,27.5,22.83,8.2200000000000006,7.57]
[2019,10,4,11,43742.458333333132,4.5199999999999996,"Valid",7.27,16.78,"Valid",22.5,null,null,4.5199999999999996,7.27,16.78,22.5,16.78,22.5,4.5199999999999996,7.27]
[2019,10,4,12,43742.499999999796,5.89,"Valid",7.24,22.09,"Valid",22.64,null,null,5.89,7.24,22.09,22.64,22.09,22.64,5.89,7.24]
[2019,10,4,13,43742.541666666461,5.98,"Valid",7.29,18.22,"Valid",22.74,null,null,5.98,7.29,18.22,22.74,18.22,22.74,5.98,7.29]
[2019,10,4,14,43742.583333333125,6.28,"Valid",7.41,33.270000000000003,"Valid",23.56,null,null,6.28,7.41,33.270000000000003,23.56,33.270000000000003,23.56,6.28,7.41]
[2019,10,4,15,43742.624999999789,11.5,"Valid",7.48,32.4,"Valid",24.07,null,null,11.5,7.48,32.4,24.07,32.4,24.07,11.5,7.48]
[2019,10,4,16,43742.666666666453,5.71,"Valid",7.43,26.82,"Valid",24.49,null,null,5.71,7.43,26.82,24.49,26.82,24.49,5.71,7.43]
[2019,{"$f":"B90","v":10},{"$f":"C67+1","v":4},17,43742.708333333117,8.08,"Valid",7.4,28.75,"Valid",24.89,null,null,8.08,7.4,28.75,24.89,28.75,24.89,8.08,7.4]
[2019,10,4,18,43742.749999999782,8.35,"Valid",7.4,31.42,"Valid",25.05,null,null,8.35,7.4,31.42,25.05,31.42,25.05,8.35,7.4]
[2019,10,4,19,43742.791666666446,6.65,"Valid",7.46,28.18,"Valid",25.06,null,null,6.65,7.46,28.18,25.06,28.18,25.06,6.65,7.46]
[2019,10,4,20,43742.83333333311,9.6999999999999993,"Valid",7.58,42.49,"Valid",25.86,null,null,9.6999999999999993,7.58,42.49,25.86,42.49,25.86,9.6999999999999993,7.58]
[2019,10,4,21,43742.874999999774,5.25,"Valid",7.59,28.33,"Valid",26.37,null,null,5.25,7.59,28.33,26.37,28.33,26.37,5.25,7.59]
[2019,10,4,22,43742.916666666439,4.8099999999999996,"Valid",7.57,25.47,"Valid",26.69,null,null,4.8099999999999996,7.57,25.47,26.69,25.47,26.69,4.8099999999999996,7.57]
[2019,10,4,23,43742.958333333103,3.65,"Valid",7.39,26.82,"Valid",26.85,null,null,3.65,7.39,26.82,26.85,26.82,26.85,3.65,7.39]
[2019,10,5,0,43742.999999999767,5.81,"Valid",7.22,30.36,"Valid",27.02,null,null,5.81,7.22,30.36,27.02,30.36,27.02,5.81,7.22]
[2019,10,5,1,43743.041666666431,6.54,"Valid",7.3,28.7,"Valid",27.3,null,null,6.54,7.3,28.7,27.3,28.7,27.3,6.54,7.3]
[2019,10,5,2,43743.083333333096,6.87,"Valid",7.3,28.49,"Valid",27.33,null,null,6.87,7.3,28.49,27.33,28.49,27.33,6.87,7.3]
[2019,10,5,3,43743.12499999976,3.89,"Valid",7.26,25.1,"Valid",27.52,null,null,3.89,7.26,25.1,27.52,25.1,27.52,3.89,7.26]
[2019,10,5,4,43743.166666666424,7.27,"Valid",7.28,26.39,"Valid",27.79,null,null,7.27,7.28,26.39,27.79,26.39,27.79,7.27,7.28]
[2019,10,5,5,43743.208333333088,16.309999999999999,"Valid",7.4,32.44,"Valid",27.89,null,null,16.309999999999999,7.4,32.44,27.89,32.44,27.89,16.309999999999999,7.4]
[2019,10,5,6,43743.249999999753,13.52,"Valid",7.58,27.87,"Valid",27.7,null,null,13.52,7.58,27.87,27.7,27.87,27.7,13.52,7.58]
[2019,10,5,7,43743.291666666417,17.760000000000002,"Valid",7.94,34.06,"Valid",28.08,null,null,17.760000000000002,7.94,34.06,28.08,34.06,28.08,17.760000000000002,7.94]
[2019,10,5,8,43743.333333333081,12.25,"Valid",8.08,28.57,"Valid",28.17,null,null,12.25,8.08,28.57,28.17,28.57,28.17,12.25,8.08]
[2019,10,5,9,43743.374999999745,14.89,"Valid",8.32,27.95,"Valid",28.27,null,null,14.89,8.32,27.95,28.27,27.95,28.27,14.89,8.32]
[2019,10,5,10,43743.41666666641,7.8,"Valid",8.3000000000000007,23.44,"Valid",28.1,null,null,7.8,8.3000000000000007,23.44,28.1,23.44,28.1,7.8,8.3000000000000007]
[2019,10,5,11,43743.458333333074,8.01,"Valid",8.4499999999999993,29.66,"Valid",28.64,null,null,8.01,8.4499999999999993,29.66,28.64,29.66,28.64,8.01,8.4499999999999993]
[2019,10,5,12,43743.499999999738,7.47,"Valid",8.51,20.64,"Valid",28.58,null,null,7.47,8.51,20.64,28.58,20.64,28.58,7.47,8.51]
[2019,10,5,13,43743.541666666402,13.72,"Valid",8.84,25.23,"Valid",28.87,null,null,13.72,8.84,25.23,28.87,25.23,28.87,13.72,8.84]
[2019,10,5,14,43743.583333333067,12.03,"Valid",9.08,19.850000000000001,"Valid",28.31,null,null,12.03,9.08,19.850000000000001,28.31,19.850000000000001,28.31,12.03,9.08]
[2019,10,5,15,43743.624999999731,9.75,"Valid",9,16.350000000000001,"Valid",27.64,null,null,9.75,9,16.350000000000001,27.64,16.350000000000001,27.64,9.75,9]
[2019,10,5,16,43743.666666666395,9.1,"Valid",9.15,18.13,"Valid",27.28,null,null,9.1,9.15,18.13,27.28,18.13,27.28,9.1,9.15]
[2019,10,5,17,43743.708333333059,9.82,"Valid",9.2200000000000006,20.94,"Valid",26.95,null,null,9.82,9.2200000000000006,20.94,26.95,20.94,26.95,9.82,9.2200000000000006]
[2019,10,5,18,43743.749999999724,12.02,"Valid",9.3699999999999992,21.6,"Valid",26.54,null,null,12.02,9.3699999999999992,21.6,26.54,21.6,26.54,12.02,9.3699999999999992]
[2019,10,5,19,43743.791666666388,10.55,"Valid",9.5299999999999994,20.83,"Valid",26.24,null,null,10.55,9.5299999999999994,20.83,26.24,20.83,26.24,10.55,9.5299999999999994]
[2019,10,5,20,43743.833333333052,7.29,"Valid",9.43,30.43,"Valid",25.74,null,null,7.29,9.43,30.43,25.74,30.43,25.74,7.29,9.43]
[2019,10,5,21,43743.874999999716,6.72,"Valid",9.49,16.420000000000002,"Valid",25.24,null,null,6.72,9.49,16.420000000000002,25.24,16.420000000000002,25.24,6.72,9.49]
[2019,10,5,22,43743.91666666638,3.7,"Valid",9.4499999999999993,9.44,"Valid",24.57,null,null,3.7,9.4499999999999993,9.44,24.57,9.44,24.57,3.7,9.4499999999999993]
{"$rows_left_out":626}
{"sheet":"Raw data_format","index":4,"n_rows":8,"n_cols":6,"rows_kept":8,"cut":false,"hidden":false,"merged":[]}
["Parameter","Format","Comment","Units of measure","Minimum","Maximum"]
["Year","yyyy","4 integer format","Not applicable",2015,"Until reporting ceases"]
["Month","mm","2 integer format","Not applicable",1,12]
["Day","dd","2 integer format","Not applicable",1,31]
["Hour","hh","2 integer format","Not applicable",0,23]
["PM10",0,"1 decimal place resolution","µg/m3","Negative","Instrument specific"]
["PM2.5",0,"2 decimal place resolution","µg/m3","Negative","Instrument specific"]
["Status","Text","7 character format","Not applicable","Valid","Invalid"]