{"text_format":"1","workbook":"xlsx","n_sheets":8,"sheets":["Instructions","Meta data_sheet","Meta data_lookup","Raw data_sheet","Raw data_format","24hr_PM10_chart","24hr_PM2.5_chart","Sheet1"],"not_rendered":{"charts":4,"images":0,"macros":1,"external_links":0,"defined_names":16,"comments":0,"pivot_tables":0},"unopened":[{"sheet":"24hr_PM10_chart","index":5,"reason":"not_a_worksheet"},{"sheet":"24hr_PM2.5_chart","index":6,"reason":"not_a_worksheet"}],"bounds":{"document_bytes":16777216,"sheet_cells":100000,"rows_first":2000,"rows_last":500,"rows_between":2000,"halvings":0,"cell_chars":16384,"cell_head_chars":4096},"cells_cut":0,"cells_raw":0,"read":"whole","date_system":"1900"}

{"sheet":"Instructions","index":0,"n_rows":0,"n_cols":0,"rows_kept":0,"cut":false,"hidden":false,"merged":[]}

{"sheet":"Meta data_sheet","index":1,"n_rows":17,"n_cols":5,"rows_kept":17,"cut":false,"hidden":false,"merged":[[18,0,18,1],[16,0,16,1]]}
["Ambient Monitoring Station","Details",null,"Ambient Monitoring Results","Details"]
["Location","Maules Creek",null,"PM2.5 monitoring start (dd/mm/yyyy hh:mm)","2025-06-01"]
["Easting",{"$f":"VLOOKUP($B$2,'Meta data_lookup'!$A$2:$D$5,2,FALSE)","v":225302},null,"PM2.5 monitoring end","2025-06-30"]
["Northing",{"$f":"VLOOKUP($B$2,'Meta data_lookup'!$A$2:$D$5,3,FALSE)","v":6623037},null,"PM2.5 monitoring period (h)",{"$f":"(E3-E2)*24","v":696}]
["Site elevation (m)",{"$f":"VLOOKUP($B$2,'Meta data_lookup'!$A$2:$D$5,4,FALSE)","v":"ND"},null,"Number of valid PM2.5 results",{"$f":"COUNTIF('Raw data_sheet'!G2:G745,\"Valid\")","v":614}]
["Description of surrounding land use","Agriculture/Mining",null,"Proportion of valid PM2.5 results (%)",{"$f":"E5/E4","v":0.88218390804597702}]
["Typical sources impacting on the site","Agriculture/Mining/Unsealed Roads",null,"PM10 monitoring start (dd/mm/yyyy hh:mm)","2025-06-01"]
["Site compliance with AS/NZS 3580.1.1:2007","Yes",null,"PM10 monitoring end","2025-06-30"]
["PM2.5 method compliance with AS/NZS 3580.9.13:2013\n","Yes",null,"PM10 monitoring period (h)",{"$f":"(E8-E7)*24","v":696}]
["PM2.5 instrument make","Thermo Scientific",null,"Number of valid PM10 results",{"$f":"COUNTIF('Raw data_sheet'!J2:J745,\"Valid\")","v":614}]
["PM2.5 instrument model","1405DF",null,"Proportion of valid PM10 results (%)",{"$f":"E10/E9","v":0.88218390804597702}]
["PM2.5 instrument intake height (m)",3.5]
["PM10 method compliance with AS 3580.9.8-2008\n","No*"]
["PM10 instrument make","Thermo Scientific"]
["PM10 instrument model","1405DF"]
["PM10 instrument intake height (m)",3.5]
["*The 1405DF TEOM used at this site measures PM10 indirectly rather than directly. The unit does however meet the intent of AS 3580.9.8-2008, and this method has been accredited by the USEPA. It is considered scientifically robust and is used extensively throughout NSW with EPA's knowledge and informal acceptance."]

{"sheet":"Meta data_lookup","index":2,"n_rows":5,"n_cols":4,"rows_kept":5,"cut":false,"hidden":false,"merged":[]}
["Location","Easting","Northing","Site elevation (m)"]
["Maules Creek",225302,6623037,"ND"]
["Breeza",237993,6542606,"ND"]
["Will-gai",231804,6596392,"ND"]
["Werris Creek",276783,6528734,"ND"]

{"sheet":"Raw data_sheet","index":3,"n_rows":745,"n_cols":21,"rows_kept":745,"cut":false,"hidden":false,"merged":[]}
["Year","Month","Day","Hour","Date and time","PM2.5_hourly","PM2.5_Data_Status","PM2.5_24hr_rolling_average","PM10_hourly","PM10_Data_Status","PM10_24hr_rolling_average","Cause of data invalidity, if applicable","Detailed comments","PM2.5_hourly_valid_plot","PM2.5_24hr_rolling_ave_valid_plot","PM10_hourly_valid_plot","PM10_24hr_rolling_ave_valid_plot","PM10_hourly_valid_plot_series","PM10_24hr_rolling_average_valid_plot_series","PM2.5_hourly_valid_plot_series","PM2.5_24hr_rolling_average_valid_plot_series"]
[2025,6,1,0,{"$f":"DATE(A2,B2,C2)+TIME(D2,0,0)","v":45809},4.17,"Valid",2.5745833333333334,4.28,"Valid",4.6495833333333341,"","",{"$f":"IF(G2=\"Valid\", F2, NA())","v":4.17},{"$f":"IF(G2=\"Valid\", H2, NA())","v":2.5745833333333334},{"$f":"IF(J2=\"Valid\", I2, NA())","v":4.28},{"$f":"IF(J2=\"Valid\", K2, NA())","v":4.6495833333333341},4.28,4.6495833333333341,4.17,2.5745833333333334]
[2025,6,{"$f":"C2","v":1},{"$f":"IF(D2=23,0,D2+1)","v":1},{"$f":"E2+0.0416666666666666","v":45809.041666666664},5.16,"Valid",2.7675000000000005,6.17,"Valid",4.8225000000000007,"","",5.16,{"$f":"IF(G3=\"Valid\", H3, NA())","v":2.7675000000000005},6.17,4.8225000000000007,6.17,4.8225000000000007,5.16,2.7675000000000005]
[2025,6,{"$f":"C3","v":1},{"$f":"IF(D3=23,0,D3+1)","v":2},{"$f":"E3+0.0416666666666666","v":45809.083333333328},0.41,"Valid",2.7583333333333333,2.5099999999999998,"Valid",4.8537500000000007,"","",0.41,2.7583333333333333,2.5099999999999998,4.8537500000000007,2.5099999999999998,4.8537500000000007,0.41,2.7583333333333333]
[2025,6,1,3,45809.124999999993,0.41,"Valid",2.6237499999999998,3.2,"Valid",4.7750000000000012,"","",0.41,2.6237499999999998,3.2,4.7750000000000012,3.2,4.7750000000000012,0.41,2.6237499999999998]
[2025,6,1,4,45809.166666666657,1.97,"Valid",2.6070833333333336,3.8,"Valid",4.8012500000000014,"","",1.97,2.6070833333333336,3.8,4.8012500000000014,3.8,4.8012500000000014,1.97,2.6070833333333336]
[2025,6,1,5,45809.208333333321,1.97,"Valid",2.6649999999999996,2.72,"Valid",4.8329166666666676,"","",1.97,2.6649999999999996,2.72,4.8329166666666676,2.72,4.8329166666666676,1.97,2.6649999999999996]
[2025,6,1,6,45809.249999999985,2.1800000000000002,"Valid",2.7316666666666669,3.57,"Valid",4.7354166666666675,"","",2.1800000000000002,2.7316666666666669,3.57,4.7354166666666675,3.57,4.7354166666666675,2.1800000000000002,2.7316666666666669]
[2025,6,1,7,45809.29166666665,-2.77,"Valid",2.4220833333333327,-2.08,"Valid",4.4612500000000006,"","",-2.77,2.4220833333333327,-2.08,4.4612500000000006,-2.08,4.4612500000000006,-2.77,2.4220833333333327]
[2025,6,1,8,45809.333333333314,2.0499999999999998,"Valid",2.2770833333333331,4.47,"Valid",4.3187500000000005,"","",2.0499999999999998,2.2770833333333331,4.47,4.3187500000000005,4.47,4.3187500000000005,2.0499999999999998,2.2770833333333331]
[2025,6,1,9,45809.374999999978,4.88,"Valid",2.2441666666666662,9.7799999999999994,"Valid",4.3108333333333331,"","",4.88,2.2441666666666662,9.7799999999999994,4.3108333333333331,9.7799999999999994,4.3108333333333331,4.88,2.2441666666666662]
[2025,6,1,10,45809.416666666642,6.23,"Valid",2.2674999999999996,14.18,"Valid",4.5987499999999999,"","",6.23,2.2674999999999996,14.18,4.5987499999999999,14.18,4.5987499999999999,6.23,2.2674999999999996]
[2025,6,1,11,45809.458333333307,4.22,"Valid",2.3099999999999992,17.489999999999998,"Valid",5.0370833333333325,"","",4.22,2.3099999999999992,17.489999999999998,5.0370833333333325,17.489999999999998,5.0370833333333325,4.22,2.3099999999999992]
[2025,6,1,12,45809.499999999971,3.45,"Valid",2.3920833333333325,11.24,"Valid",5.2149999999999999,"","",3.45,2.3920833333333325,11.24,5.2149999999999999,11.24,5.2149999999999999,3.45,2.3920833333333325]
[2025,6,1,13,45809.541666666635,3.81,"Valid",2.4441666666666664,11.24,"Valid",5.4645833333333336,"","",3.81,2.4441666666666664,11.24,5.4645833333333336,11.24,5.4645833333333336,3.81,2.4441666666666664]
[2025,6,1,14,45809.583333333299,4.0199999999999996,"Valid",2.4329166666666668,21.21,"Valid",6.0308333333333328,"","",4.0199999999999996,2.4329166666666668,21.21,6.0308333333333328,21.21,6.0308333333333328,4.0199999999999996,2.4329166666666668]
[2025,6,1,15,45809.624999999964,5.3,"Valid",2.5629166666666663,21.93,"Valid",6.6270833333333323,"","",5.3,2.5629166666666663,21.93,6.6270833333333323,21.93,6.6270833333333323,5.3,2.5629166666666663]
[2025,6,1,16,45809.666666666628,4.67,"Valid",2.6283333333333334,15.32,"Valid",6.9899999999999993,"","",4.67,2.6283333333333334,15.32,6.9899999999999993,15.32,6.9899999999999993,4.67,2.6283333333333334]
[2025,6,1,17,45809.708333333292,0.99,"Valid",2.5404166666666668,4.13,"Valid",6.9695833333333326,"","",0.99,2.5404166666666668,4.13,6.9695833333333326,4.13,6.9695833333333326,0.99,2.5404166666666668]
[2025,6,1,18,45809.749999999956,0.08,"Valid",2.4495833333333334,6.5,"Valid",7.1679166666666658,"","",0.08,2.4495833333333334,6.5,7.1679166666666658,6.5,7.1679166666666658,0.08,2.4495833333333334]
[2025,6,1,19,45809.791666666621,0.52,"Valid",2.51125,4.1500000000000004,"Valid",7.3554166666666667,"","",0.52,2.51125,4.1500000000000004,7.3554166666666667,4.1500000000000004,7.3554166666666667,0.52,2.51125]
[2025,6,1,20,45809.833333333285,2.64,"Valid",2.6595833333333334,5.19,"Valid",7.5716666666666663,"","",2.64,2.6595833333333334,5.19,7.5716666666666663,5.19,7.5716666666666663,2.64,2.6595833333333334]
[2025,6,1,21,45809.874999999949,1.78,"Valid",2.6987500000000004,5.19,"Valid",7.7879166666666668,"","",1.78,2.6987500000000004,5.19,7.7879166666666668,5.19,7.7879166666666668,1.78,2.6987500000000004]
[2025,6,1,22,45809.916666666613,2.2999999999999998,"Valid",2.6920833333333332,4.0199999999999996,"Valid",7.770833333333333,"","",2.2999999999999998,2.6920833333333332,4.0199999999999996,7.770833333333333,4.0199999999999996,7.770833333333333,2.2999999999999998,2.6920833333333332]
[2025,6,{"$f":"C24","v":1},23,45809.958333333278,1.76,"Valid",2.5916666666666672,2.82,"Valid",7.6262499999999998,"","",1.76,2.5916666666666672,2.82,7.6262499999999998,2.82,7.6262499999999998,1.76,2.5916666666666672]
[2025,6,{"$f":"C2+1","v":2},0,45809.999999999942,1.78,"Valid",2.492083333333333,3.81,"Valid",7.6066666666666665,"","",1.78,2.492083333333333,3.81,7.6066666666666665,3.81,7.6066666666666665,1.78,2.492083333333333]
[2025,6,{"$f":"C3+1","v":2},1,45810.041666666606,-1.93,"Valid",2.1966666666666668,-0.7,"Valid",7.3204166666666666,"","",-1.93,2.1966666666666668,-0.7,7.3204166666666666,-0.7,7.3204166666666666,-1.93,2.1966666666666668]
[2025,6,2,2,45810.08333333327,-1.5,"Valid",2.117083333333333,0.35,"Valid",7.2304166666666667,"","",-1.5,2.117083333333333,0.35,7.2304166666666667,0.35,7.2304166666666667,-1.5,2.117083333333333]
[2025,6,2,3,45810.124999999935,-0.69,"Valid",2.07125,0.48,"Valid",7.1170833333333325,"","",-0.69,2.07125,0.48,7.1170833333333325,0.48,7.1170833333333325,-0.69,2.07125]
[2025,6,2,4,45810.166666666599,-2.0299999999999998,"Valid",1.9045833333333333,-0.79,"Valid",6.9258333333333333,"","",-2.0299999999999998,1.9045833333333333,-0.79,6.9258333333333333,-0.79,6.9258333333333333,-2.0299999999999998,1.9045833333333333]
[2025,6,2,5,45810.208333333263,0.04,"Valid",1.8241666666666667,1.5,"Valid",6.875,"","",0.04,1.8241666666666667,1.5,6.875,1.5,6.875,0.04,1.8241666666666667]
[2025,6,2,6,45810.249999999927,1.01,"Valid",1.7754166666666666,2.35,"Valid",6.8241666666666667,"","",1.01,1.7754166666666666,2.35,6.8241666666666667,2.35,6.8241666666666667,1.01,1.7754166666666666]
[2025,6,2,7,45810.291666666591,0.61,"Valid",1.9162499999999998,3.78,"Valid",7.0683333333333342,"","",0.61,1.9162499999999998,3.78,7.0683333333333342,3.78,7.0683333333333342,0.61,1.9162499999999998]
[2025,6,2,8,45810.333333333256,1.72,"Valid",1.9024999999999999,4.34,"Valid",7.0629166666666672,"","",1.72,1.9024999999999999,4.34,7.0629166666666672,4.34,7.0629166666666672,1.72,1.9024999999999999]
[2025,6,2,9,45810.37499999992,4.1399999999999997,"Valid",1.8716666666666664,7.13,"Valid",6.9524999999999997,"","",4.1399999999999997,1.8716666666666664,7.13,6.9524999999999997,7.13,6.9524999999999997,4.1399999999999997,1.8716666666666664]
[2025,6,2,10,45810.416666666584,5.16,"Valid",1.8270833333333332,10.17,"Valid",6.7854166666666664,"","",5.16,1.8270833333333332,10.17,6.7854166666666664,10.17,6.7854166666666664,5.16,1.8270833333333332]
[2025,6,2,11,45810.458333333248,4.7699999999999996,"Valid",1.8499999999999996,9.92,"Valid",6.469999999999998,"","",4.7699999999999996,1.8499999999999996,9.92,6.469999999999998,9.92,6.469999999999998,4.7699999999999996,1.8499999999999996]
[2025,6,2,12,45810.499999999913,4.7699999999999996,"Valid",1.9049999999999994,7.4,"Valid",6.3099999999999987,"","",4.7699999999999996,1.9049999999999994,7.4,6.3099999999999987,7.4,6.3099999999999987,4.7699999999999996,1.9049999999999994]
[2025,6,2,13,45810.541666666577,2.79,"Valid",1.8624999999999998,19,"Valid",6.6333333333333329,"","",2.79,1.8624999999999998,19,6.6333333333333329,19,6.6333333333333329,2.79,1.8624999999999998]
[2025,6,2,14,45810.583333333241,0.88,"Valid",1.7316666666666667,7.99,"Valid",6.0824999999999996,"","",0.88,1.7316666666666667,7.99,6.0824999999999996,7.99,6.0824999999999996,0.88,1.7316666666666667]
[2025,6,2,15,45810.624999999905,1.0900000000000001,"Valid",1.5562500000000004,3.18,"Valid",5.3012500000000005,"","",1.0900000000000001,1.5562500000000004,3.18,5.3012500000000005,3.18,5.3012500000000005,1.0900000000000001,1.5562500000000004]
[2025,6,2,16,45810.66666666657,1.0900000000000001,"Valid",1.4070833333333335,3.61,"Valid",4.8133333333333335,"","",1.0900000000000001,1.4070833333333335,3.61,4.8133333333333335,3.61,4.8133333333333335,1.0900000000000001,1.4070833333333335]
[2025,6,2,17,45810.708333333234,3.77,"Valid",1.5229166666666669,12.19,"Valid",5.1491666666666669,"","",3.77,1.5229166666666669,12.19,5.1491666666666669,12.19,5.1491666666666669,3.77,1.5229166666666669]
[2025,6,2,18,45810.749999999898,1.57,"Valid",1.5850000000000002,8.4499999999999993,"Valid",5.2304166666666676,"","",{"$f":"IF(G44=\"Valid\", F44, NA())","v":1.57},1.5850000000000002,8.4499999999999993,5.2304166666666676,8.4499999999999993,5.2304166666666676,1.57,1.5850000000000002]
[2025,6,2,19,45810.791666666562,2.14,"Valid",1.6525000000000001,6.04,"Valid",5.309166666666667,"","",2.14,1.6525000000000001,6.04,5.309166666666667,6.04,5.309166666666667,2.14,1.6525000000000001]
[2025,6,2,20,45810.833333333227,1.84,"Valid",1.6191666666666669,5.0599999999999996,"Valid",5.3037500000000009,"","",1.84,{"$f":"IF(G46=\"Valid\", H46, NA())","v":1.6191666666666669},{"$f":"IF(J46=\"Valid\", I46, NA())","v":5.0599999999999996},5.3037500000000009,5.0599999999999996,5.3037500000000009,1.84,1.6191666666666669]
[2025,6,2,21,45810.874999999891,1.64,"Valid",1.6133333333333333,2.95,"Valid",5.2104166666666671,"","",1.64,1.6133333333333333,2.95,5.2104166666666671,2.95,5.2104166666666671,1.64,1.6133333333333333]
[2025,6,2,22,45810.916666666555,-0.7,"Valid",1.4883333333333333,0.73,"Valid",5.0733333333333341,"","",-0.7,1.4883333333333333,0.73,5.0733333333333341,0.73,5.0733333333333341,-0.7,1.4883333333333333]
[2025,6,2,23,45810.958333333219,3.48,"Valid",1.5599999999999998,4.6900000000000004,"Valid",5.151250000000001,"","",3.48,1.5599999999999998,4.6900000000000004,5.151250000000001,4.6900000000000004,5.151250000000001,3.48,1.5599999999999998]
[2025,6,3,0,45810.999999999884,-7.0000000000000007E-2,"Valid",1.4829166666666662,1.76,"Valid",5.0658333333333347,"","",-7.0000000000000007E-2,1.4829166666666662,1.76,5.0658333333333347,1.76,5.0658333333333347,-7.0000000000000007E-2,1.4829166666666662]
[2025,6,3,1,45811.041666666548,-0.44,"Valid",1.5449999999999999,1.0900000000000001,"Valid",5.1404166666666677,"","",-0.44,1.5449999999999999,1.0900000000000001,5.1404166666666677,1.0900000000000001,5.1404166666666677,-0.44,1.5449999999999999]
[2025,6,3,2,45811.083333333212,-0.44,"Valid",1.5891666666666666,-0.55000000000000004,"Valid",5.1029166666666681,"","",-0.44,1.5891666666666666,-0.55000000000000004,5.1029166666666681,-0.55000000000000004,5.1029166666666681,-0.44,1.5891666666666666]
[2025,6,3,3,45811.124999999876,1.76,"Valid",1.6912499999999999,4.1100000000000003,"Valid",5.2541666666666673,"","",1.76,1.6912499999999999,4.1100000000000003,5.2541666666666673,4.1100000000000003,5.2541666666666673,1.76,1.6912499999999999]
[2025,6,3,4,45811.166666666541,1.76,"Valid",1.8491666666666664,-3,"Valid",5.1620833333333342,"","",1.76,1.8491666666666664,-3,5.1620833333333342,-3,5.1620833333333342,1.76,1.8491666666666664]
[2025,6,3,5,45811.208333333205,-3.26,"Valid",1.7116666666666667,-2.42,"Valid",4.9987500000000011,"","",-3.26,1.7116666666666667,-2.42,4.9987500000000011,-2.42,4.9987500000000011,-3.26,1.7116666666666667]
[2025,6,3,6,45811.249999999869,2.23,"Valid",1.7624999999999995,2.9,"Valid",5.0216666666666683,"","",2.23,1.7624999999999995,2.9,5.0216666666666683,2.9,5.0216666666666683,2.23,1.7624999999999995]
[2025,6,3,7,45811.291666666533,-3.17,"Valid",1.6049999999999995,-2.4300000000000002,"Valid",4.7629166666666682,"","",-3.17,1.6049999999999995,-2.4300000000000002,4.7629166666666682,-2.4300000000000002,4.7629166666666682,-3.17,1.6049999999999995]
[2025,6,3,8,45811.333333333198,3.8,"Valid",1.6916666666666662,4.57,"Valid",4.7725000000000009,"","",3.8,1.6916666666666662,4.57,4.7725000000000009,4.57,4.7725000000000009,3.8,1.6916666666666662]
[2025,6,3,9,45811.374999999862,-1.48,"Valid",1.4574999999999998,-0.67,"Valid",4.4475000000000007,"","",-1.48,1.4574999999999998,-0.67,4.4475000000000007,-0.67,4.4475000000000007,-1.48,1.4574999999999998]
[2025,6,3,10,45811.416666666526,2.11,"Valid",1.330416666666667,-0.67,"Valid",3.9958333333333336,"","",2.11,1.330416666666667,-0.67,3.9958333333333336,-0.67,3.9958333333333336,2.11,1.330416666666667]
[2025,6,3,11,45811.45833333319,-0.06,"Valid",1.1291666666666669,0.19,"Valid",3.5904166666666675,"","",-0.06,1.1291666666666669,0.19,3.5904166666666675,0.19,3.5904166666666675,-0.06,1.1291666666666669]
[2025,6,3,12,45811.499999999854,0.32,"Valid",0.94375000000000009,1.42,"Valid",3.3412500000000005,"","",0.32,0.94375000000000009,1.42,3.3412500000000005,1.42,3.3412500000000005,0.32,0.94375000000000009]
[2025,6,3,13,45811.541666666519,0.32,"Valid",0.84083333333333332,6.99,"Valid",2.8408333333333329,"","",0.32,0.84083333333333332,6.99,2.8408333333333329,6.99,2.8408333333333329,0.32,0.84083333333333332]
[2025,6,3,14,45811.583333333183,4.7,"Valid",1.0000000000000002,5.62,"Valid",2.7420833333333334,"","",4.7,1.0000000000000002,5.62,2.7420833333333334,5.62,2.7420833333333334,4.7,1.0000000000000002]
[2025,6,3,15,45811.624999999847,4.7,"Valid",1.1504166666666666,5.62,"Valid",2.84375,"","",4.7,1.1504166666666666,5.62,2.84375,5.62,2.84375,4.7,1.1504166666666666]
[2025,6,3,16,45811.666666666511,4.21,"Valid",1.2804166666666668,6.18,"Valid",2.9508333333333332,"","",4.21,{"$f":"IF(G66=\"Valid\", H66, NA())","v":1.2804166666666668},{"$f":"IF(J66=\"Valid\", I66, NA())","v":6.18},{"$f":"IF(J66=\"Valid\", K66, NA())","v":2.9508333333333332},6.18,2.9508333333333332,4.21,1.2804166666666668]
[2025,6,3,17,45811.708333333176,-1.81,"Valid",1.0479166666666668,-0.05,"Valid",2.440833333333333,"","",-1.81,1.0479166666666668,-0.05,2.440833333333333,-0.05,2.440833333333333,-1.81,1.0479166666666668]
[2025,6,3,{"$f":"IF(D67=23,0,D67+1)","v":18},{"$f":"E67+0.0416666666666666","v":45811.74999999984},3.23,"Valid",1.1170833333333334,4.45,"Valid",2.2741666666666664,"","",3.23,1.1170833333333334,4.45,2.2741666666666664,4.45,2.2741666666666664,3.23,1.1170833333333334]
[2025,6,3,19,45811.791666666504,5.16,"Valid",1.2429166666666667,5.87,"Valid",2.2670833333333333,"","",5.16,1.2429166666666667,5.87,2.2670833333333333,5.87,2.2670833333333333,5.16,1.2429166666666667]
[2025,6,3,20,45811.833333333168,2.61,"Valid",1.2750000000000001,3.87,"Valid",2.2175000000000002,"","",2.61,1.2750000000000001,3.87,2.2175000000000002,3.87,2.2175000000000002,2.61,1.2750000000000001]
[2025,6,3,21,45811.874999999833,-4.0999999999999996,"Valid",1.0358333333333336,-2.52,"Valid",1.9895833333333333,"","",-4.0999999999999996,1.0358333333333336,-2.52,1.9895833333333333,-2.52,1.9895833333333333,-4.0999999999999996,1.0358333333333336]
[2025,6,3,22,45811.916666666497,4.6500000000000004,"Valid",1.25875,6.09,"Valid",2.2129166666666666,"","",4.6500000000000004,1.25875,6.09,2.2129166666666666,6.09,2.2129166666666666,4.6500000000000004,1.25875]
[2025,6,3,23,45811.958333333161,4.32,"Valid",1.29375,5.78,"Valid",2.2583333333333329,"","",4.32,1.29375,5.78,2.2583333333333329,5.78,2.2583333333333329,4.32,1.29375]
[2025,6,4,0,45811.999999999825,-0.32,"Valid",1.2833333333333332,1.18,"Valid",2.2341666666666664,"","",-0.32,1.2833333333333332,1.18,2.2341666666666664,1.18,2.2341666666666664,-0.32,1.2833333333333332]
[2025,6,4,1,45812.04166666649,3.38,"Valid",1.4424999999999999,4.83,"Valid",2.3899999999999997,"","",3.38,1.4424999999999999,4.83,2.3899999999999997,4.83,2.3899999999999997,3.38,1.4424999999999999]
[2025,6,4,2,45812.083333333154,2.31,"Valid",1.5570833333333336,3.24,"Valid",2.5479166666666662,"","",2.31,1.5570833333333336,3.24,2.5479166666666662,3.24,2.5479166666666662,2.31,1.5570833333333336]
[2025,6,4,3,45812.124999999818,2.31,"Valid",1.58,1.34,"Valid",2.4324999999999997,"","",2.31,1.58,1.34,2.4324999999999997,1.34,2.4324999999999997,2.31,1.58]
[2025,6,4,4,45812.166666666482,0.88,"Valid",1.5433333333333332,1.36,"Valid",2.6141666666666663,"","",0.88,1.5433333333333332,1.36,2.6141666666666663,1.36,2.6141666666666663,0.88,1.5433333333333332]
[2025,6,4,5,45812.208333333147,0.88,"Valid",1.7158333333333335,2.6,"Valid",2.8233333333333328,"","",0.88,1.7158333333333335,2.6,2.8233333333333328,2.6,2.8233333333333328,0.88,1.7158333333333335]
[2025,6,4,6,45812.249999999811,1.68,"Valid",1.6929166666666671,3.53,"Valid",2.8495833333333329,"","",1.68,1.6929166666666671,3.53,2.8495833333333329,3.53,2.8495833333333329,1.68,1.6929166666666671]
{"$rows_left_out":666}
{"sheet":"Raw data_format","index":4,"n_rows":8,"n_cols":6,"rows_kept":8,"cut":false,"hidden":false,"merged":[]}
["Parameter","Format","Comment","Units of measure","Minimum","Maximum"]
["Year","yyyy","4 integer format","Not applicable",2015,"Until reporting ceases"]
["Month","mm","2 integer format","Not applicable",1,12]
["Day","dd","2 integer format","Not applicable",1,31]
["Hour","hh","2 integer format","Not applicable",0,23]
["PM10",0,"1 decimal place resolution","µg/m3","Negative","Instrument specific"]
["PM2.5",0,"2 decimal place resolution","µg/m3","Negative","Instrument specific"]
["Status","Text","7 character format","Not applicable","Valid","Invalid"]

{"sheet":"Sheet1","index":7,"n_rows":0,"n_cols":0,"rows_kept":0,"cut":false,"hidden":false,"merged":[]}