{"text_format":"1","workbook":"xlsx","n_sheets":8,"sheets":["Instructions","Meta data_sheet","Meta data_lookup","Raw data_sheet","Raw data_format","24hr_PM10_chart","24hr_PM2.5_chart","Sheet1"],"not_rendered":{"charts":4,"images":0,"macros":1,"external_links":0,"defined_names":16,"comments":0,"pivot_tables":0},"unopened":[{"sheet":"24hr_PM10_chart","index":5,"reason":"not_a_worksheet"},{"sheet":"24hr_PM2.5_chart","index":6,"reason":"not_a_worksheet"}],"bounds":{"document_bytes":16777216,"sheet_cells":100000,"rows_first":2000,"rows_last":500,"rows_between":2000,"halvings":0,"cell_chars":16384,"cell_head_chars":4096},"cells_cut":0,"cells_raw":0,"read":"whole","date_system":"1900"}

{"sheet":"Instructions","index":0,"n_rows":0,"n_cols":0,"rows_kept":0,"cut":false,"hidden":false,"merged":[]}

{"sheet":"Meta data_sheet","index":1,"n_rows":17,"n_cols":5,"rows_kept":17,"cut":false,"hidden":false,"merged":[[18,0,18,1],[16,0,16,1]]}
["Ambient Monitoring Station","Details",null,"Ambient Monitoring Results","Details"]
["Location","Maules Creek",null,"PM2.5 monitoring start (dd/mm/yyyy hh:mm)","2025-04-01"]
["Easting",{"$f":"VLOOKUP($B$2,'Meta data_lookup'!$A$2:$D$5,2,FALSE)","v":225302},null,"PM2.5 monitoring end","2025-04-14"]
["Northing",{"$f":"VLOOKUP($B$2,'Meta data_lookup'!$A$2:$D$5,3,FALSE)","v":6623037},null,"PM2.5 monitoring period (h)",{"$f":"(E3-E2)*24","v":312}]
["Site elevation (m)",{"$f":"VLOOKUP($B$2,'Meta data_lookup'!$A$2:$D$5,4,FALSE)","v":"ND"},null,"Number of valid PM2.5 results",{"$f":"COUNTIF('Raw data_sheet'!G2:G745,\"Valid\")","v":312}]
["Description of surrounding land use","Agriculture/Mining",null,"Proportion of valid PM2.5 results (%)",{"$f":"E5/E4","v":1}]
["Typical sources impacting on the site","Agriculture/Mining/Unsealed Roads",null,"PM10 monitoring start (dd/mm/yyyy hh:mm)","2025-04-01"]
["Site compliance with AS/NZS 3580.1.1:2007","Yes",null,"PM10 monitoring end","2025-04-14"]
["PM2.5 method compliance with AS/NZS 3580.9.13:2013\n","Yes",null,"PM10 monitoring period (h)",{"$f":"(E8-E7)*24","v":312}]
["PM2.5 instrument make","Thermo Scientific",null,"Number of valid PM10 results",{"$f":"COUNTIF('Raw data_sheet'!J2:J745,\"Valid\")","v":312}]
["PM2.5 instrument model","1405DF",null,"Proportion of valid PM10 results (%)",{"$f":"E10/E9","v":1}]
["PM2.5 instrument intake height (m)",3.5]
["PM10 method compliance with AS 3580.9.8-2008\n","No*"]
["PM10 instrument make","Thermo Scientific"]
["PM10 instrument model","1405DF"]
["PM10 instrument intake height (m)",3.5]
["*The 1405DF TEOM used at this site measures PM10 indirectly rather than directly. The unit does however meet the intent of AS 3580.9.8-2008, and this method has been accredited by the USEPA. It is considered scientifically robust and is used extensively throughout NSW with EPA's knowledge and informal acceptance."]

{"sheet":"Meta data_lookup","index":2,"n_rows":5,"n_cols":4,"rows_kept":5,"cut":false,"hidden":false,"merged":[]}
["Location","Easting","Northing","Site elevation (m)"]
["Maules Creek",225302,6623037,"ND"]
["Breeza",237993,6542606,"ND"]
["Will-gai",231804,6596392,"ND"]
["Werris Creek",276783,6528734,"ND"]

{"sheet":"Raw data_sheet","index":3,"n_rows":745,"n_cols":21,"rows_kept":745,"cut":false,"hidden":false,"merged":[]}
["Year","Month","Day","Hour","Date and time","PM2.5_hourly","PM2.5_Data_Status","PM2.5_24hr_rolling_average","PM10_hourly","PM10_Data_Status","PM10_24hr_rolling_average","Cause of data invalidity, if applicable","Detailed comments","PM2.5_hourly_valid_plot","PM2.5_24hr_rolling_ave_valid_plot","PM10_hourly_valid_plot","PM10_24hr_rolling_ave_valid_plot","PM10_hourly_valid_plot_series","PM10_24hr_rolling_average_valid_plot_series","PM2.5_hourly_valid_plot_series","PM2.5_24hr_rolling_average_valid_plot_series"]
[2025,4,1,0,{"$f":"DATE(A2,B2,C2)+TIME(D2,0,0)","v":45748},3.85,"Valid",3.6229166666666668,5.73,"Valid",8.4845833333333331,"","",{"$f":"IF(G2=\"Valid\", F2, NA())","v":3.85},{"$f":"IF(G2=\"Valid\", H2, NA())","v":3.6229166666666668},{"$f":"IF(J2=\"Valid\", I2, NA())","v":5.73},{"$f":"IF(J2=\"Valid\", K2, NA())","v":8.4845833333333331},5.73,8.4845833333333331,3.85,3.6229166666666668]
[2025,4,{"$f":"C2","v":1},{"$f":"IF(D2=23,0,D2+1)","v":1},{"$f":"E2+0.0416666666666666","v":45748.041666666664},2.57,"Valid",3.6016666666666666,4.53,"Valid",8.4283333333333328,"","",2.57,{"$f":"IF(G3=\"Valid\", H3, NA())","v":3.6016666666666666},4.53,8.4283333333333328,4.53,8.4283333333333328,2.57,3.6016666666666666]
[2025,4,{"$f":"C3","v":1},{"$f":"IF(D3=23,0,D3+1)","v":2},{"$f":"E3+0.0416666666666666","v":45748.083333333328},2.15,"Valid",3.5454166666666662,3.72,"Valid",8.2958333333333325,"","",2.15,3.5454166666666662,3.72,8.2958333333333325,3.72,8.2958333333333325,2.15,3.5454166666666662]
[2025,4,1,3,45748.124999999993,1.65,"Valid",3.5779166666666669,3.34,"Valid",8.2445833333333329,"","",1.65,3.5779166666666669,3.34,8.2445833333333329,3.34,8.2445833333333329,1.65,3.5779166666666669]
[2025,4,1,4,45748.166666666657,0.7,"Valid",3.6529166666666666,2.21,"Valid",8.1962500000000009,"","",0.7,3.6529166666666666,2.21,8.1962500000000009,2.21,8.1962500000000009,0.7,3.6529166666666666]
[2025,4,1,5,45748.208333333321,2.1800000000000002,"Valid",3.6712500000000006,3.69,"Valid",8.0829166666666676,"","",2.1800000000000002,3.6712500000000006,3.69,8.0829166666666676,3.69,8.0829166666666676,2.1800000000000002,3.6712500000000006]
[2025,4,1,6,45748.249999999985,2.34,"Valid",3.67625,3.94,"Valid",7.9641666666666664,"","",2.34,3.67625,3.94,7.9641666666666664,3.94,7.9641666666666664,2.34,3.67625]
[2025,4,1,7,45748.29166666665,2.0299999999999998,"Valid",3.5920833333333335,4.08,"Valid",7.7495833333333337,"","",2.0299999999999998,3.5920833333333335,4.08,7.7495833333333337,4.08,7.7495833333333337,2.0299999999999998,3.5920833333333335]
[2025,4,1,8,45748.333333333314,4.1100000000000003,"Valid",3.6362500000000004,6.23,"Valid",7.6679166666666667,"","",4.1100000000000003,3.6362500000000004,6.23,7.6679166666666667,6.23,7.6679166666666667,4.1100000000000003,3.6362500000000004]
[2025,4,1,9,45748.374999999978,3.48,"Valid",3.5158333333333349,5.53,"Valid",7.439166666666666,"","",3.48,3.5158333333333349,5.53,7.439166666666666,5.53,7.439166666666666,3.48,3.5158333333333349]
[2025,4,1,10,45748.416666666642,1.64,"Valid",3.5812500000000012,3.55,"Valid",7.4383333333333326,"","",1.64,3.5812500000000012,3.55,7.4383333333333326,3.55,7.4383333333333326,1.64,3.5812500000000012]
[2025,4,1,11,45748.458333333307,-2.0099999999999998,"Valid",3.5179166666666681,0.25,"Valid",7.37,"","",-2.0099999999999998,3.5179166666666681,0.25,7.37,0.25,7.37,-2.0099999999999998,3.5179166666666681]
[2025,4,1,12,45748.499999999971,1.53,"Valid",3.4358333333333348,4.47,"Valid",7.3170833333333327,"","",1.53,3.4358333333333348,4.47,7.3170833333333327,4.47,7.3170833333333327,1.53,3.4358333333333348]
[2025,4,1,13,45748.541666666635,3.04,"Valid",3.4083333333333337,8.0500000000000007,"Valid",7.4070833333333335,"","",3.04,3.4083333333333337,8.0500000000000007,7.4070833333333335,8.0500000000000007,7.4070833333333335,3.04,3.4083333333333337]
[2025,4,1,14,45748.583333333299,4.46,"Valid",3.2449999999999997,8,"Valid",7.2633333333333345,"","",4.46,3.2449999999999997,8,7.2633333333333345,8,7.2633333333333345,4.46,3.2449999999999997]
[2025,4,1,15,45748.624999999964,2.57,"Valid",2.9229166666666662,6.07,"Valid",6.6937500000000005,"","",2.57,2.9229166666666662,6.07,6.6937500000000005,6.07,6.6937500000000005,2.57,2.9229166666666662]
[2025,4,1,16,45748.666666666628,5.36,"Valid",2.9387499999999993,9.5399999999999991,"Valid",6.4941666666666658,"","",5.36,2.9387499999999993,9.5399999999999991,6.4941666666666658,9.5399999999999991,6.4941666666666658,5.36,2.9387499999999993]
[2025,4,1,17,45748.708333333292,3.17,"Valid",2.7866666666666666,5.9,"Valid",6.1662499999999989,"","",3.17,2.7866666666666666,5.9,6.1662499999999989,5.9,6.1662499999999989,3.17,2.7866666666666666]
[2025,4,1,18,45748.749999999956,0.79,"Valid",2.7116666666666664,4.0199999999999996,"Valid",5.8133333333333335,"","",0.79,2.7116666666666664,4.0199999999999996,5.8133333333333335,4.0199999999999996,5.8133333333333335,0.79,2.7116666666666664]
[2025,4,1,19,45748.791666666621,-2.29,"Valid",2.4662500000000001,0.06,"Valid",5.4304166666666669,"","",-2.29,2.4662500000000001,0.06,5.4304166666666669,0.06,5.4304166666666669,-2.29,2.4662500000000001]
[2025,4,1,20,45748.833333333285,2.95,"Valid",2.3470833333333334,5.45,"Valid",4.8358333333333334,"","",2.95,2.3470833333333334,5.45,4.8358333333333334,5.45,4.8358333333333334,2.95,2.3470833333333334]
[2025,4,1,21,45748.874999999949,1.93,"Valid",2.3170833333333336,4.55,"Valid",4.8070833333333329,"","",1.93,2.3170833333333336,4.55,4.8070833333333329,4.55,4.8070833333333329,1.93,2.3170833333333336]
[2025,4,1,22,45748.916666666613,6.53,"Valid",2.4491666666666672,9.3000000000000007,"Valid",4.9354166666666659,"","",6.53,2.4491666666666672,9.3000000000000007,4.9354166666666659,9.3000000000000007,4.9354166666666659,6.53,2.4491666666666672]
[2025,4,{"$f":"C24","v":1},23,45748.958333333278,3.32,"Valid",2.4187500000000002,6.69,"Valid",4.9541666666666657,"","",3.32,2.4187500000000002,6.69,4.9541666666666657,6.69,4.9541666666666657,3.32,2.4187500000000002]
[2025,4,{"$f":"C2+1","v":2},0,45748.999999999942,4.59,"Valid",2.4495833333333334,8.17,"Valid",5.0558333333333332,"","",4.59,2.4495833333333334,8.17,5.0558333333333332,8.17,5.0558333333333332,4.59,2.4495833333333334]
[2025,4,{"$f":"C3+1","v":2},1,45749.041666666606,4.95,"Valid",2.5487500000000005,8.49,"Valid",5.2208333333333323,"","",4.95,2.5487500000000005,8.49,5.2208333333333323,8.49,5.2208333333333323,4.95,2.5487500000000005]
[2025,4,2,2,45749.08333333327,3.56,"Valid",2.6075000000000004,6.65,"Valid",5.3429166666666665,"","",3.56,2.6075000000000004,6.65,5.3429166666666665,6.65,5.3429166666666665,3.56,2.6075000000000004]
[2025,4,2,3,45749.124999999935,7.05,"Valid",2.8325,10.65,"Valid",5.6475,"","",7.05,2.8325,10.65,5.6475,10.65,5.6475,7.05,2.8325]
[2025,4,2,4,45749.166666666599,6.72,"Valid",3.0833333333333335,9.58,"Valid",5.9545833333333347,"","",6.72,3.0833333333333335,9.58,5.9545833333333347,9.58,5.9545833333333347,6.72,3.0833333333333335]
[2025,4,2,5,45749.208333333263,7.87,"Valid",3.320416666666667,10.210000000000001,"Valid",6.2262500000000003,"","",7.87,3.320416666666667,10.210000000000001,6.2262500000000003,10.210000000000001,6.2262500000000003,7.87,3.320416666666667]
[2025,4,2,6,45749.249999999927,4.03,"Valid",3.3908333333333336,6.21,"Valid",6.3208333333333337,"","",4.03,3.3908333333333336,6.21,6.3208333333333337,6.21,6.3208333333333337,4.03,3.3908333333333336]
[2025,4,2,7,45749.291666666591,7.52,"Valid",3.6195833333333334,9.34,"Valid",6.5400000000000018,"","",7.52,3.6195833333333334,9.34,6.5400000000000018,9.34,6.5400000000000018,7.52,3.6195833333333334]
[2025,4,2,8,45749.333333333256,6.99,"Valid",3.7395833333333335,8.69,"Valid",6.642500000000001,"","",6.99,3.7395833333333335,8.69,6.642500000000001,8.69,6.642500000000001,6.99,3.7395833333333335]
[2025,4,2,9,45749.37499999992,12.4,"Valid",4.1112500000000001,13.9,"Valid",6.9912500000000009,"","",12.4,4.1112500000000001,13.9,6.9912500000000009,13.9,6.9912500000000009,12.4,4.1112500000000001]
[2025,4,2,10,45749.416666666584,4.5,"Valid",4.2304166666666667,5.52,"Valid",7.0733333333333341,"","",4.5,4.2304166666666667,5.52,7.0733333333333341,5.52,7.0733333333333341,4.5,4.2304166666666667]
[2025,4,2,11,45749.458333333248,7.32,"Valid",4.6191666666666675,8.65,"Valid",7.4233333333333347,"","",7.32,4.6191666666666675,8.65,7.4233333333333347,8.65,7.4233333333333347,7.32,4.6191666666666675]
[2025,4,2,12,45749.499999999913,5.79,"Valid",4.7966666666666677,6.04,"Valid",7.4887499999999996,"","",5.79,4.7966666666666677,6.04,7.4887499999999996,6.04,7.4887499999999996,5.79,4.7966666666666677]
[2025,4,2,13,45749.541666666577,7.37,"Valid",4.9770833333333337,7.89,"Valid",7.4820833333333328,"","",7.37,4.9770833333333337,7.89,7.4820833333333328,7.89,7.4820833333333328,7.37,4.9770833333333337]
[2025,4,2,14,45749.583333333241,4.49,"Valid",4.9783333333333344,5.0599999999999996,"Valid",7.359583333333334,"","",4.49,4.9783333333333344,5.0599999999999996,7.359583333333334,5.0599999999999996,7.359583333333334,4.49,4.9783333333333344]
[2025,4,2,15,45749.624999999905,7.71,"Valid",5.1924999999999999,8.4700000000000006,"Valid",7.4595833333333337,"","",7.71,5.1924999999999999,8.4700000000000006,7.4595833333333337,8.4700000000000006,7.4595833333333337,7.71,5.1924999999999999]
[2025,4,2,16,45749.66666666657,2.87,"Valid",5.0887500000000001,3.95,"Valid",7.2266666666666657,"","",2.87,5.0887500000000001,3.95,7.2266666666666657,3.95,7.2266666666666657,2.87,5.0887500000000001]
[2025,4,2,17,45749.708333333234,7.39,"Valid",5.2645833333333334,7.58,"Valid",7.296666666666666,"","",7.39,5.2645833333333334,7.58,7.296666666666666,7.58,7.296666666666666,7.39,5.2645833333333334]
[2025,4,2,18,45749.749999999898,6.76,"Valid",5.5133333333333328,7.51,"Valid",7.4420833333333327,"","",{"$f":"IF(G44=\"Valid\", F44, NA())","v":6.76},5.5133333333333328,7.51,7.4420833333333327,7.51,7.4420833333333327,6.76,5.5133333333333328]
[2025,4,2,19,45749.791666666562,6.56,"Valid",5.8820833333333331,6.89,"Valid",7.7266666666666657,"","",6.56,5.8820833333333331,6.89,7.7266666666666657,6.89,7.7266666666666657,6.56,5.8820833333333331]
[2025,4,2,20,45749.833333333227,8.82,"Valid",6.126666666666666,9.6300000000000008,"Valid",7.9008333333333312,"","",8.82,{"$f":"IF(G46=\"Valid\", H46, NA())","v":6.126666666666666},{"$f":"IF(J46=\"Valid\", I46, NA())","v":9.6300000000000008},7.9008333333333312,9.6300000000000008,7.9008333333333312,8.82,6.126666666666666]
[2025,4,2,21,45749.874999999891,6.19,"Valid",6.3041666666666663,7.19,"Valid",8.0108333333333324,"","",6.19,6.3041666666666663,7.19,8.0108333333333324,7.19,8.0108333333333324,6.19,6.3041666666666663]
[2025,4,2,22,45749.916666666555,6.9,"Valid",6.3195833333333331,8.32,"Valid",7.9699999999999989,"","",6.9,6.3195833333333331,8.32,7.9699999999999989,8.32,7.9699999999999989,6.9,6.3195833333333331]
[2025,4,2,23,45749.958333333219,6.71,"Valid",6.4608333333333343,8.36,"Valid",8.0395833333333329,"","",6.71,6.4608333333333343,8.36,8.0395833333333329,8.36,8.0395833333333329,6.71,6.4608333333333343]
[2025,4,3,0,45749.999999999884,9.7100000000000009,"Valid",6.6741666666666681,11.51,"Valid",8.1787499999999991,null,"",9.7100000000000009,6.6741666666666681,11.51,8.1787499999999991,11.51,8.1787499999999991,9.7100000000000009,6.6741666666666681]
[2025,4,3,1,45750.041666666548,6.05,"Valid",6.7200000000000024,7.65,"Valid",8.1437499999999989,null,"",6.05,6.7200000000000024,7.65,8.1437499999999989,7.65,8.1437499999999989,6.05,6.7200000000000024]
[2025,4,3,2,45750.083333333212,5.34,"Valid",6.7941666666666691,7.42,"Valid",8.1758333333333315,null,"",5.34,6.7941666666666691,7.42,8.1758333333333315,7.42,8.1758333333333315,5.34,6.7941666666666691]
[2025,4,3,3,45750.124999999876,9.4,"Valid",6.8920833333333356,12.11,"Valid",8.2366666666666664,null,"",9.4,6.8920833333333356,12.11,8.2366666666666664,12.11,8.2366666666666664,9.4,6.8920833333333356]
[2025,4,3,4,45750.166666666541,3.6,"Valid",6.7620833333333357,5.81,"Valid",8.0795833333333338,null,"",3.6,6.7620833333333357,5.81,8.0795833333333338,5.81,8.0795833333333338,3.6,6.7620833333333357]
[2025,4,3,5,45750.208333333205,5.62,"Valid",6.6683333333333339,7.9,"Valid",7.9833333333333334,null,"",5.62,6.6683333333333339,7.9,7.9833333333333334,7.9,7.9833333333333334,5.62,6.6683333333333339]
[2025,4,3,6,45750.249999999869,6.03,"Valid",6.7516666666666678,8.8000000000000007,"Valid",8.0912500000000005,null,"",6.03,6.7516666666666678,8.8000000000000007,8.0912500000000005,8.8000000000000007,8.0912500000000005,6.03,6.7516666666666678]
[2025,4,3,7,45750.291666666533,6.85,"Valid",6.723749999999999,9.39,"Valid",8.0933333333333337,null,"",6.85,6.723749999999999,9.39,8.0933333333333337,9.39,8.0933333333333337,6.85,6.723749999999999]
[2025,4,3,8,45750.333333333198,9.76,"Valid",6.8391666666666646,11.34,"Valid",8.2037500000000012,null,"",9.76,6.8391666666666646,11.34,8.2037500000000012,11.34,8.2037500000000012,9.76,6.8391666666666646]
[2025,4,3,9,45750.374999999862,4.62,"Valid",6.5149999999999997,6.95,"Valid",7.9141666666666675,null,"",4.62,6.5149999999999997,6.95,7.9141666666666675,6.95,7.9141666666666675,4.62,6.5149999999999997]
[2025,4,3,10,45750.416666666526,4.71,"Valid",6.5237499999999997,5.8,"Valid",7.925833333333336,null,"",4.71,6.5237499999999997,5.8,7.925833333333336,5.8,7.925833333333336,4.71,6.5237499999999997]
[2025,4,3,11,45750.45833333319,8.98,"Valid",6.5929166666666665,10.38,"Valid",7.9979166666666677,null,"",8.98,6.5929166666666665,10.38,7.9979166666666677,10.38,7.9979166666666677,8.98,6.5929166666666665]
[2025,4,3,12,45750.499999999854,8.2100000000000009,"Valid",6.6937500000000005,9.75,"Valid",8.1525000000000016,null,"",8.2100000000000009,6.6937500000000005,9.75,8.1525000000000016,9.75,8.1525000000000016,8.2100000000000009,6.6937500000000005]
[2025,4,3,13,45750.541666666519,10,"Valid",6.8033333333333337,12.12,"Valid",8.3287500000000012,null,"",10,6.8033333333333337,12.12,8.3287500000000012,12.12,8.3287500000000012,10,6.8033333333333337]
[2025,4,3,14,45750.583333333183,7.61,"Valid",6.9333333333333345,11.37,"Valid",8.5916666666666668,null,"",7.61,6.9333333333333345,11.37,8.5916666666666668,11.37,8.5916666666666668,7.61,6.9333333333333345]
[2025,4,3,15,45750.624999999847,8.7200000000000006,"Valid",6.9754166666666677,13.39,"Valid",8.7966666666666669,null,"",8.7200000000000006,6.9754166666666677,13.39,8.7966666666666669,13.39,8.7966666666666669,8.7200000000000006,6.9754166666666677]
[2025,4,3,16,45750.666666666511,9.66,"Valid",7.2583333333333337,14.52,"Valid",9.2370833333333344,null,"",9.66,{"$f":"IF(G66=\"Valid\", H66, NA())","v":7.2583333333333337},{"$f":"IF(J66=\"Valid\", I66, NA())","v":14.52},{"$f":"IF(J66=\"Valid\", K66, NA())","v":9.2370833333333344},14.52,9.2370833333333344,9.66,7.2583333333333337]
[2025,4,3,17,45750.708333333176,9.67,"Valid",7.3533333333333344,14.89,"Valid",9.5416666666666696,null,"",9.67,7.3533333333333344,14.89,9.5416666666666696,14.89,9.5416666666666696,9.67,7.3533333333333344]
[2025,4,3,{"$f":"IF(D67=23,0,D67+1)","v":18},{"$f":"E67+0.0416666666666666","v":45750.74999999984},9.36,"Valid",7.461666666666666,13.6,"Valid",9.7954166666666698,null,"",9.36,7.461666666666666,13.6,9.7954166666666698,13.6,9.7954166666666698,9.36,7.461666666666666]
[2025,4,3,19,45750.791666666504,11.32,"Valid",7.6599999999999993,16.07,"Valid",10.177916666666667,null,"",11.32,7.6599999999999993,16.07,10.177916666666667,16.07,10.177916666666667,11.32,7.6599999999999993]
[2025,4,3,20,45750.833333333168,10.97,"Valid",7.7495833333333328,15.45,"Valid",10.420416666666666,null,"",10.97,7.7495833333333328,15.45,10.420416666666666,15.45,10.420416666666666,10.97,7.7495833333333328]
[2025,4,3,21,45750.874999999833,12.12,"Valid",7.9966666666666661,17.29,"Valid",10.84125,null,"",12.12,7.9966666666666661,17.29,10.84125,17.29,10.84125,12.12,7.9966666666666661]
[2025,4,3,22,45750.916666666497,14.16,"Valid",8.2991666666666664,19.350000000000001,"Valid",11.300833333333335,null,"",14.16,8.2991666666666664,19.350000000000001,11.300833333333335,19.350000000000001,11.300833333333335,14.16,8.2991666666666664]
[2025,4,3,23,45750.958333333161,12.7,"Valid",8.5487499999999983,19.100000000000001,"Valid",11.748333333333335,null,"",12.7,8.5487499999999983,19.100000000000001,11.748333333333335,19.100000000000001,11.748333333333335,12.7,8.5487499999999983]
[2025,4,4,0,45750.999999999825,8.24,"Valid",8.4874999999999989,13.5,"Valid",11.831249999999999,null,"",8.24,8.4874999999999989,13.5,11.831249999999999,13.5,11.831249999999999,8.24,8.4874999999999989]
[2025,4,4,1,45751.04166666649,12.33,"Valid",8.7491666666666656,17.04,"Valid",12.222500000000002,null,"",12.33,8.7491666666666656,17.04,12.222500000000002,17.04,12.222500000000002,12.33,8.7491666666666656]
[2025,4,4,2,45751.083333333154,10.67,"Valid",8.9712499999999995,14.98,"Valid",12.537500000000001,null,"",10.67,8.9712499999999995,14.98,12.537500000000001,14.98,12.537500000000001,10.67,8.9712499999999995]
[2025,4,4,3,45751.124999999818,14.9,"Valid",9.2004166666666674,19.21,"Valid",12.833333333333334,null,"",14.9,9.2004166666666674,19.21,12.833333333333334,19.21,12.833333333333334,14.9,9.2004166666666674]
[2025,4,4,4,45751.166666666482,13.77,"Valid",9.6241666666666674,17.02,"Valid",13.300416666666665,null,"",13.77,9.6241666666666674,17.02,13.300416666666665,17.02,13.300416666666665,13.77,9.6241666666666674]
[2025,4,4,5,45751.208333333147,8.56,"Valid",9.7466666666666679,12.62,"Valid",13.497083333333331,null,"",8.56,9.7466666666666679,12.62,13.497083333333331,12.62,13.497083333333331,8.56,9.7466666666666679]
[2025,4,4,6,45751.249999999811,10.82,"Valid",9.9462500000000009,15.06,"Valid",13.757916666666665,null,"",10.82,9.9462500000000009,15.06,13.757916666666665,15.06,13.757916666666665,10.82,9.9462500000000009]
{"$rows_left_out":666}
{"sheet":"Raw data_format","index":4,"n_rows":8,"n_cols":6,"rows_kept":8,"cut":false,"hidden":false,"merged":[]}
["Parameter","Format","Comment","Units of measure","Minimum","Maximum"]
["Year","yyyy","4 integer format","Not applicable",2015,"Until reporting ceases"]
["Month","mm","2 integer format","Not applicable",1,12]
["Day","dd","2 integer format","Not applicable",1,31]
["Hour","hh","2 integer format","Not applicable",0,23]
["PM10",0,"1 decimal place resolution","µg/m3","Negative","Instrument specific"]
["PM2.5",0,"2 decimal place resolution","µg/m3","Negative","Instrument specific"]
["Status","Text","7 character format","Not applicable","Valid","Invalid"]

{"sheet":"Sheet1","index":7,"n_rows":0,"n_cols":0,"rows_kept":0,"cut":false,"hidden":false,"merged":[]}