{"text_format":"1","workbook":"xlsx","n_sheets":7,"sheets":["Instructions","Meta data_sheet","Meta data_lookup","Raw data_format","Raw data_sheet","24hr_PM10_chart","24hr_PM2.5_chart"],"not_rendered":{"charts":4,"images":0,"macros":1,"external_links":0,"defined_names":15,"comments":0,"pivot_tables":0},"unopened":[{"sheet":"24hr_PM10_chart","index":5,"reason":"not_a_worksheet"},{"sheet":"24hr_PM2.5_chart","index":6,"reason":"not_a_worksheet"}],"bounds":{"document_bytes":16777216,"sheet_cells":100000,"rows_first":2000,"rows_last":500,"rows_between":2000,"halvings":0,"cell_chars":16384,"cell_head_chars":4096},"cells_cut":0,"cells_raw":0,"read":"whole","date_system":"1900"}

{"sheet":"Instructions","index":0,"n_rows":0,"n_cols":0,"rows_kept":0,"cut":false,"hidden":false,"merged":[]}

{"sheet":"Meta data_sheet","index":1,"n_rows":17,"n_cols":5,"rows_kept":17,"cut":false,"hidden":false,"merged":[[18,0,18,1],[16,0,16,1]]}
["Ambient Monitoring Station","Details",null,"Ambient Monitoring Results","Details"]
["Location","Will-gai",null,"PM2.5 monitoring start (dd/mm/yyyy hh:mm)","2025-03-01"]
["Easting",{"$f":"VLOOKUP($B$2,'Meta data_lookup'!$A$2:$D$5,2,FALSE)","v":231804},null,"PM2.5 monitoring end","2025-04-01"]
["Northing",{"$f":"VLOOKUP($B$2,'Meta data_lookup'!$A$2:$D$5,3,FALSE)","v":6596392},null,"PM2.5 monitoring period (h)",{"$f":"(E3-E2)*24","v":744}]
["Site elevation (m)",{"$f":"VLOOKUP($B$2,'Meta data_lookup'!$A$2:$D$5,4,FALSE)","v":294},null,"Number of valid PM2.5 results",{"$f":"COUNTIF('Raw data_sheet'!G2:G745,\"Valid\")","v":740}]
["Description of surrounding land use","Agriculture/Mining",null,"Proportion of valid PM2.5 results (%)",{"$f":"E5/E4","v":0.9946236559139785}]
["Typical sources impacting on the site","Agriculture",null,"PM10 monitoring start (dd/mm/yyyy hh:mm)","2025-03-01"]
["Site compliance with AS/NZS 3580.1.1:2007","Yes",null,"PM10 monitoring end","2025-04-01"]
["PM2.5 method compliance with AS/NZS 3580.9.13:2013\n","Yes",null,"PM10 monitoring period (h)",{"$f":"(E8-E7)*24","v":744}]
["PM2.5 instrument make","Thermo Scientific",null,"Number of valid PM10 results",{"$f":"COUNTIF('Raw data_sheet'!J2:J745,\"Valid\")","v":740}]
["PM2.5 instrument model","1405DF",null,"Proportion of valid PM10 results (%)",{"$f":"E10/E9","v":0.9946236559139785}]
["PM2.5 instrument intake height (m)",3.5]
["PM10 method compliance with AS 3580.9.8-2008\n","No*"]
["PM10 instrument make","Thermo Scientific"]
["PM10 instrument model","1405DF"]
["PM10 instrument intake height (m)",3.5]
["*The 1405DF TEOM used at this site measures PM10 indirectly rather than directly. The unit does however meet the intent of AS 3580.9.8-2008, and this method has been accredited by the USEPA. It is considered scientifically robust and is used extensively throughout NSW with EPA's knowledge and informal acceptance."]

{"sheet":"Meta data_lookup","index":2,"n_rows":5,"n_cols":4,"rows_kept":5,"cut":false,"hidden":false,"merged":[]}
["Location","Easting","Northing","Site elevation (m)"]
["Maules Creek",225302,6623037,"ND"]
["Breeza",237993,6542606,"ND"]
["Will-gai",231804,6596392,294]
["Werris Creek",276783,6528734,362]

{"sheet":"Raw data_format","index":3,"n_rows":8,"n_cols":6,"rows_kept":8,"cut":false,"hidden":false,"merged":[]}
["Parameter","Format","Comment","Units of measure","Minimum","Maximum"]
["Year","yyyy","4 integer format","Not applicable",2015,"Until reporting ceases"]
["Month","mm","2 integer format","Not applicable",1,12]
["Day","dd","2 integer format","Not applicable",1,31]
["Hour","hh","2 integer format","Not applicable",0,23]
["PM10",0,"1 decimal place resolution","µg/m3","Negative","Instrument specific"]
["PM2.5",0,"2 decimal place resolution","µg/m3","Negative","Instrument specific"]
["Status","Text","7 character format","Not applicable","Valid","Invalid"]

{"sheet":"Raw data_sheet","index":4,"n_rows":745,"n_cols":21,"rows_kept":745,"cut":false,"hidden":false,"merged":[]}
["Year","Month","Day","Hour","Date and time","PM2.5_hourly","PM2.5_Data_Status","PM2.5_24hr_rolling_average","PM10_hourly","PM10_Data_Status","PM10_24hr_rolling_average",null,null,"PM2.5_hourly_valid_plot","PM2.5_24hr_rolling_ave_valid_plot","PM10_hourly_valid_plot","PM10_24hr_rolling_ave_valid_plot","PM10_hourly_valid_plot_series","PM10_24hr_rolling_average_valid_plot_series","PM2.5_hourly_valid_plot_series","PM2.5_24hr_rolling_average_valid_plot_series"]
[2025,3,1,0,{"$f":"DATE(A2,B2,C2)+TIME(D2,0,0)","v":45717},15.18,"Valid",17.440416666666664,21.91,"Valid",39.715833333333322,"","",{"$f":"IF(G2=\"Valid\", F2, NA())","v":15.18},{"$f":"IF(G2=\"Valid\", H2, NA())","v":17.440416666666664},{"$f":"IF(J2=\"Valid\", I2, NA())","v":21.91},{"$f":"IF(J2=\"Valid\", K2, NA())","v":39.715833333333322},21.91,39.715833333333322,15.18,17.440416666666664]
[2025,3,{"$f":"C2","v":1},{"$f":"IF(D2=23,0,D2+1)","v":1},{"$f":"E2+0.0416666666666666","v":45717.041666666664},15.56,"Valid",17.793749999999999,29.97,"Valid",40.437499999999993,"","",15.56,17.793749999999999,29.97,40.437499999999993,29.97,40.437499999999993,15.56,17.793749999999999]
[2025,3,{"$f":"C3","v":1},{"$f":"IF(D3=23,0,D3+1)","v":2},{"$f":"E3+0.0416666666666666","v":45717.083333333328},16.989999999999998,"Valid",18.025416666666665,32.42,"Valid",41.130833333333321,"","",16.989999999999998,18.025416666666665,32.42,41.130833333333321,32.42,41.130833333333321,16.989999999999998,18.025416666666665]
[2025,3,1,3,45717.124999999993,19.66,"Valid",18.365416666666665,34.74,"Valid",41.89374999999999,"","",19.66,18.365416666666665,34.74,41.89374999999999,34.74,41.89374999999999,19.66,18.365416666666665]
[2025,3,1,4,45717.166666666657,19.93,"Valid",18.547916666666666,36.07,"Valid",40.64041666666666,"","",19.93,18.547916666666666,36.07,40.64041666666666,36.07,40.64041666666666,19.93,18.547916666666666]
[2025,3,1,5,45717.208333333321,19.809999999999999,"Valid",18.692916666666665,29.84,"Valid",39.797916666666659,"","",19.809999999999999,18.692916666666665,29.84,39.797916666666659,29.84,39.797916666666659,19.809999999999999,18.692916666666665]
[2025,3,1,6,45717.249999999985,17.329999999999998,"Valid",17.079583333333336,32.119999999999997,"Valid",31.501666666666669,"","",17.329999999999998,17.079583333333336,32.119999999999997,31.501666666666669,32.119999999999997,31.501666666666669,17.329999999999998,17.079583333333336]
[2025,3,1,7,45717.29166666665,40.369999999999997,"Valid",17.807916666666667,161.82,"Valid",35.229583333333345,"","",40.369999999999997,17.807916666666667,161.82,35.229583333333345,161.82,35.229583333333345,40.369999999999997,17.807916666666667]
[2025,3,1,8,45717.333333333314,18.97,"Valid",17.977083333333336,50.26,"Valid",35.632916666666667,"","",18.97,17.977083333333336,50.26,35.632916666666667,50.26,35.632916666666667,18.97,17.977083333333336]
[2025,3,1,9,45717.374999999978,17.62,"Valid",18.214166666666667,37.26,"Valid",36.357083333333343,"","",17.62,18.214166666666667,37.26,36.357083333333343,37.26,36.357083333333343,17.62,18.214166666666667]
[2025,3,1,10,45717.416666666642,14.56,"Valid",18.385000000000002,33.04,"Valid",36.680000000000007,"","",14.56,18.385000000000002,33.04,36.680000000000007,33.04,36.680000000000007,14.56,18.385000000000002]
[2025,3,1,11,45717.458333333307,16.53,"Valid",18.453333333333337,25.74,"Valid",36.715000000000003,"","",16.53,18.453333333333337,25.74,36.715000000000003,25.74,36.715000000000003,16.53,18.453333333333337]
[2025,3,1,12,45717.499999999971,17.38,"Valid",18.63,26.17,"Valid",36.8675,"","",17.38,18.63,26.17,36.8675,26.17,36.8675,17.38,18.63]
[2025,3,1,13,45717.541666666635,13.71,"Valid",18.67208333333333,22.36,"Valid",36.677499999999988,"","",13.71,18.67208333333333,22.36,36.677499999999988,22.36,36.677499999999988,13.71,18.67208333333333]
[2025,3,1,14,45717.583333333299,7.3,"Valid",18.579166666666666,17.14,"Valid",36.560416666666661,"","",7.3,18.579166666666666,17.14,36.560416666666661,17.14,36.560416666666661,7.3,18.579166666666666]
[2025,3,1,15,45717.624999999964,18.36,"Valid",18.663750000000004,32.229999999999997,"Valid",36.718749999999993,"","",18.36,18.663750000000004,32.229999999999997,36.718749999999993,32.229999999999997,36.718749999999993,18.36,18.663750000000004]
[2025,3,1,16,45717.666666666628,17.739999999999998,"Valid",18.903750000000002,27.03,"Valid",36.65208333333333,"","",17.739999999999998,18.903750000000002,27.03,36.65208333333333,27.03,36.65208333333333,17.739999999999998,18.903750000000002]
[2025,3,1,17,45717.708333333292,11.03,"Valid",18.911666666666665,22.87,"Valid",36.410416666666663,"","",11.03,18.911666666666665,22.87,36.410416666666663,22.87,36.410416666666663,11.03,18.911666666666665]
[2025,3,1,18,45717.749999999956,20.94,"Valid",18.753333333333334,29.33,"Valid",36.213749999999997,"","",20.94,18.753333333333334,29.33,36.213749999999997,29.33,36.213749999999997,20.94,18.753333333333334]
[2025,3,1,19,45717.791666666621,22.02,"Valid",18.758749999999999,30.33,"Valid",36.121249999999996,"","",22.02,18.758749999999999,30.33,36.121249999999996,30.33,36.121249999999996,22.02,18.758749999999999]
[2025,3,1,20,45717.833333333285,21.11,"Valid",18.541666666666664,25.78,"Valid",35.73833333333333,"","",21.11,18.541666666666664,25.78,35.73833333333333,25.78,35.73833333333333,21.11,18.541666666666664]
[2025,3,1,21,45717.874999999949,21.65,"Valid",18.553333333333331,30.07,"Valid",35.606666666666669,"","",21.65,18.553333333333331,30.07,35.606666666666669,30.07,35.606666666666669,21.65,18.553333333333331]
[2025,3,1,22,45717.916666666613,12.74,"Valid",18.034166666666668,19.78,"Valid",34.689583333333331,"","",12.74,18.034166666666668,19.78,34.689583333333331,19.78,34.689583333333331,12.74,18.034166666666668]
[2025,3,{"$f":"C24","v":1},23,45717.958333333278,14.71,"Valid",17.966666666666665,24.01,"Valid",34.678750000000001,"","",14.71,17.966666666666665,24.01,34.678750000000001,24.01,34.678750000000001,14.71,17.966666666666665]
[2025,3,{"$f":"C2+1","v":2},0,45717.999999999942,15.95,"Valid",17.998749999999998,21.57,"Valid",34.66458333333334,"","",15.95,17.998749999999998,21.57,34.66458333333334,21.57,34.66458333333334,15.95,17.998749999999998]
[2025,3,{"$f":"C3+1","v":2},1,45718.041666666606,10.29,"Valid",17.779166666666665,15.03,"Valid",34.042083333333338,"","",10.29,17.779166666666665,15.03,34.042083333333338,15.03,34.042083333333338,10.29,17.779166666666665]
[2025,3,2,2,45718.08333333327,14.65,"Valid",17.681666666666665,19.43,"Valid",33.50083333333334,"","",14.65,17.681666666666665,19.43,33.50083333333334,19.43,33.50083333333334,14.65,17.681666666666665]
[2025,3,2,3,45718.124999999935,14.21,"Valid",17.454583333333332,19.190000000000001,"Valid",32.852916666666673,"","",14.21,17.454583333333332,19.190000000000001,32.852916666666673,19.190000000000001,32.852916666666673,14.21,17.454583333333332]
[2025,3,2,4,45718.166666666599,12.67,"Valid",17.152083333333334,20.36,"Valid",32.198333333333338,"","",12.67,17.152083333333334,20.36,32.198333333333338,20.36,32.198333333333338,12.67,17.152083333333334]
[2025,3,2,5,45718.208333333263,14.84,"Valid",16.944999999999997,22.79,"Valid",31.904583333333338,"","",14.84,16.944999999999997,22.79,31.904583333333338,22.79,31.904583333333338,14.84,16.944999999999997]
[2025,3,2,6,45718.249999999927,24.86,"Valid",17.258749999999999,65.62,"Valid",33.300416666666671,"","",24.86,17.258749999999999,65.62,33.300416666666671,65.62,33.300416666666671,24.86,17.258749999999999]
[2025,3,2,7,45718.291666666591,26.89,"Valid",16.697083333333335,74.31,"Valid",29.654166666666669,"","",26.89,16.697083333333335,74.31,29.654166666666669,74.31,29.654166666666669,26.89,16.697083333333335]
[2025,3,2,8,45718.333333333256,25.44,"Valid",16.966666666666665,72.81,"Valid",30.59375,"","",25.44,16.966666666666665,72.81,30.59375,72.81,30.59375,25.44,16.966666666666665]
[2025,3,2,9,45718.37499999992,15.01,"Valid",16.857916666666664,29.85,"Valid",30.285,"","",15.01,16.857916666666664,29.85,30.285,29.85,30.285,15.01,16.857916666666664]
[2025,3,2,10,45718.416666666584,18.190000000000001,"Valid",17.009166666666665,25.74,"Valid",29.980833333333337,"","",18.190000000000001,17.009166666666665,25.74,29.980833333333337,25.74,29.980833333333337,18.190000000000001,17.009166666666665]
[2025,3,2,11,45718.458333333248,16.71,"Valid",17.016666666666662,27.81,"Valid",30.067083333333333,"","",16.71,17.016666666666662,27.81,30.067083333333333,27.81,30.067083333333333,16.71,17.016666666666662]
[2025,3,2,12,45718.499999999913,13.35,"Valid",16.848749999999999,21,"Valid",29.851666666666663,"","",13.35,16.848749999999999,21,29.851666666666663,21,29.851666666666663,13.35,16.848749999999999]
[2025,3,2,13,45718.541666666577,16.059999999999999,"Valid",16.946666666666665,23.22,"Valid",29.887500000000003,"","",16.059999999999999,16.946666666666665,23.22,29.887500000000003,23.22,29.887500000000003,16.059999999999999,16.946666666666665]
[2025,3,2,14,45718.583333333241,14.99,"Valid",17.267083333333332,23.46,"Valid",30.150833333333335,"","",14.99,17.267083333333332,23.46,30.150833333333335,23.46,30.150833333333335,14.99,17.267083333333332]
[2025,3,2,15,45718.624999999905,17.440000000000001,"Valid",17.228749999999998,29.31,"Valid",30.029166666666665,"","",17.440000000000001,17.228749999999998,29.31,30.029166666666665,29.31,30.029166666666665,17.440000000000001,17.228749999999998]
[2025,3,2,16,45718.66666666657,19.71,"Valid",17.310833333333331,29.88,"Valid",30.147916666666664,"","",19.71,17.310833333333331,29.88,30.147916666666664,29.88,30.147916666666664,19.71,17.310833333333331]
[2025,3,2,17,45718.708333333234,20.02,"Valid",17.685416666666665,37.39,"Valid",30.752916666666664,"","",20.02,17.685416666666665,37.39,30.752916666666664,37.39,30.752916666666664,20.02,17.685416666666665]
[2025,3,2,18,45718.749999999898,14.24,"Valid",17.406249999999996,21,"Valid",30.405833333333334,"","",14.24,17.406249999999996,21,30.405833333333334,21,30.405833333333334,14.24,17.406249999999996]
[2025,3,2,19,45718.791666666562,11.99,"Valid",16.988333333333333,22.65,"Valid",30.08583333333333,"","",11.99,16.988333333333333,22.65,30.08583333333333,22.65,30.08583333333333,11.99,16.988333333333333]
[2025,3,2,20,45718.833333333227,12.22,"Valid",16.617916666666666,20.399999999999999,"Valid",29.861666666666665,"","",12.22,16.617916666666666,20.399999999999999,29.861666666666665,20.399999999999999,29.861666666666665,12.22,16.617916666666666]
[2025,3,2,21,45718.874999999891,14.61,"Valid",16.324583333333333,26.36,"Valid",29.707083333333333,"","",14.61,16.324583333333333,26.36,29.707083333333333,26.36,29.707083333333333,14.61,16.324583333333333]
[2025,3,2,22,45718.916666666555,16.5,"Valid",16.481249999999999,23.04,"Valid",29.842916666666664,"","",16.5,16.481249999999999,23.04,29.842916666666664,23.04,29.842916666666664,16.5,16.481249999999999]
[2025,3,2,23,45718.958333333219,8.39,"Valid",16.217916666666667,14.4,"Valid",29.442499999999995,"","",8.39,16.217916666666667,14.4,29.442499999999995,14.4,29.442499999999995,8.39,16.217916666666667]
[2025,3,3,0,45718.999999999884,12.45,"Valid",16.072083333333335,18.059999999999999,"Valid",29.296249999999997,null,null,12.45,16.072083333333335,18.059999999999999,29.296249999999997,18.059999999999999,29.296249999999997,12.45,16.072083333333335]
[2025,3,3,1,45719.041666666548,19.11,"Valid",16.439583333333335,29.37,"Valid",29.893749999999994,null,null,19.11,16.439583333333335,29.37,29.893749999999994,29.37,29.893749999999994,19.11,16.439583333333335]
[2025,3,3,2,45719.083333333212,30.13,"Valid",17.084583333333335,40.159999999999997,"Valid",30.757499999999993,null,null,30.13,17.084583333333335,40.159999999999997,30.757499999999993,40.159999999999997,30.757499999999993,30.13,17.084583333333335]
[2025,3,3,3,45719.124999999876,30.08,"Valid",17.745833333333334,36.35,"Valid",31.472499999999993,null,null,30.08,17.745833333333334,36.35,31.472499999999993,36.35,31.472499999999993,30.08,17.745833333333334]
[2025,3,3,4,45719.166666666541,27.6,"Valid",18.36791666666667,32.53,"Valid",31.979583333333323,null,null,27.6,18.36791666666667,32.53,31.979583333333323,32.53,31.979583333333323,27.6,18.36791666666667]
[2025,3,3,5,45719.208333333205,23.2,"Valid",18.716250000000002,27.55,"Valid",32.177916666666654,null,null,23.2,18.716250000000002,27.55,32.177916666666654,27.55,32.177916666666654,23.2,18.716250000000002]
[2025,3,3,6,45719.249999999869,22.24,"Valid",18.607083333333335,27.54,"Valid",30.591249999999992,null,null,22.24,18.607083333333335,27.54,30.591249999999992,27.54,30.591249999999992,22.24,18.607083333333335]
[2025,3,3,7,45719.291666666533,21.8,"Valid",18.395,26.09,"Valid",28.58208333333333,null,null,21.8,18.395,26.09,28.58208333333333,26.09,28.58208333333333,21.8,18.395]
[2025,3,3,8,45719.333333333198,20.57,"Valid",18.192083333333333,25.07,"Valid",26.592916666666667,null,null,20.57,18.192083333333333,25.07,26.592916666666667,25.07,26.592916666666667,20.57,18.192083333333333]
[2025,3,3,9,45719.374999999862,17.89,"Valid",18.312083333333334,23.51,"Valid",26.328749999999999,null,null,17.89,18.312083333333334,23.51,26.328749999999999,23.51,26.328749999999999,17.89,18.312083333333334]
[2025,3,3,10,45719.416666666526,14.36,"Valid",18.1525,19.739999999999998,"Valid",26.078750000000003,null,null,14.36,18.1525,19.739999999999998,26.078750000000003,19.739999999999998,26.078750000000003,14.36,18.1525]
[2025,3,3,11,45719.45833333319,14.17,"Valid",18.046666666666667,20.13,"Valid",25.758750000000006,null,null,14.17,18.046666666666667,20.13,25.758750000000006,20.13,25.758750000000006,14.17,18.046666666666667]
[2025,3,3,12,45719.499999999854,12.32,"Valid",18.00375,18.64,"Valid",25.660416666666666,null,null,12.32,18.00375,18.64,25.660416666666666,18.64,25.660416666666666,12.32,18.00375]
[2025,3,3,13,45719.541666666519,8.7200000000000006,"Valid",17.697916666666668,18.48,"Valid",25.462916666666668,null,null,8.7200000000000006,17.697916666666668,18.48,25.462916666666668,18.48,25.462916666666668,8.7200000000000006,17.697916666666668]
[2025,3,3,14,45719.583333333183,5.44,"Valid",17.3,13.52,"Valid",25.048749999999998,null,null,5.44,17.3,13.52,25.048749999999998,13.52,25.048749999999998,5.44,17.3]
[2025,3,3,15,45719.624999999847,12.03,"Valid",17.074583333333333,31.88,"Valid",25.155833333333334,null,null,12.03,17.074583333333333,31.88,25.155833333333334,31.88,25.155833333333334,12.03,17.074583333333333]
[2025,3,3,16,45719.666666666511,8.8800000000000008,"Valid",16.623333333333331,15.33,"Valid",24.549583333333334,null,null,{"$f":"IF(G66=\"Valid\", F66, NA())","v":8.8800000000000008},{"$f":"IF(G66=\"Valid\", H66, NA())","v":16.623333333333331},{"$f":"IF(J66=\"Valid\", I66, NA())","v":15.33},{"$f":"IF(J66=\"Valid\", K66, NA())","v":24.549583333333334},15.33,24.549583333333334,8.8800000000000008,16.623333333333331]
[2025,3,3,17,45719.708333333176,14.92,"Valid",16.410833333333333,25.79,"Valid",24.06625,null,null,14.92,16.410833333333333,25.79,24.06625,25.79,24.06625,14.92,16.410833333333333]
[2025,3,3,{"$f":"IF(D67=23,0,D67+1)","v":18},{"$f":"E67+0.0416666666666666","v":45719.74999999984},15.07,"Valid",16.445416666666667,30.83,"Valid",24.475833333333338,null,null,15.07,16.445416666666667,30.83,24.475833333333338,30.83,24.475833333333338,15.07,16.445416666666667]
[2025,3,3,19,45719.791666666504,12.45,"Valid",16.464583333333334,27,"Valid",24.657083333333333,null,null,12.45,16.464583333333334,27,24.657083333333333,27,24.657083333333333,12.45,16.464583333333334]
[2025,3,3,20,45719.833333333168,13.02,"Valid",16.497916666666665,28,"Valid",24.973749999999999,null,null,13.02,16.497916666666665,28,24.973749999999999,28,24.973749999999999,13.02,16.497916666666665]
[2025,3,3,21,45719.874999999833,13.2,"Valid",16.439166666666665,21.82,"Valid",24.784583333333334,null,null,13.2,16.439166666666665,21.82,24.784583333333334,21.82,24.784583333333334,13.2,16.439166666666665]
[2025,3,3,22,45719.916666666497,15,"Valid",16.376666666666665,19.399999999999999,"Valid",24.63291666666667,null,null,15,16.376666666666665,19.399999999999999,24.63291666666667,19.399999999999999,24.63291666666667,15,16.376666666666665]
[2025,3,3,23,45719.958333333161,15.01,"Valid",16.6525,18.38,"Valid",24.798749999999998,null,null,15.01,16.6525,18.38,24.798749999999998,18.38,24.798749999999998,15.01,16.6525]
[2025,3,4,0,45719.999999999825,13.47,"Valid",16.694999999999997,16.09,"Valid",24.716666666666669,null,null,13.47,16.694999999999997,16.09,24.716666666666669,16.09,24.716666666666669,13.47,16.694999999999997]
[2025,3,4,1,45720.04166666649,10.73,"Valid",16.345833333333331,13.48,"Valid",24.05458333333333,null,null,10.73,16.345833333333331,13.48,24.05458333333333,13.48,24.05458333333333,10.73,16.345833333333331]
[2025,3,4,2,45720.083333333154,10.39,"Valid",15.523333333333332,10.76,"Valid",22.829583333333332,null,null,10.39,15.523333333333332,10.76,22.829583333333332,10.76,22.829583333333332,10.39,15.523333333333332]
[2025,3,4,3,45720.124999999818,12.07,"Valid",14.772916666666665,12.44,"Valid",21.833333333333332,null,null,12.07,14.772916666666665,12.44,21.833333333333332,12.44,21.833333333333332,12.07,14.772916666666665]
[2025,3,4,4,45720.166666666482,9.98,"Valid",14.03875,11.09,"Valid",20.939999999999994,null,null,9.98,14.03875,11.09,20.939999999999994,11.09,20.939999999999994,9.98,14.03875]
[2025,3,4,5,45720.208333333147,10.32,"Valid",13.502083333333333,10.5,"Valid",20.229583333333327,null,null,10.32,13.502083333333333,10.5,20.229583333333327,10.5,20.229583333333327,10.32,13.502083333333333]
[2025,3,4,6,45720.249999999811,14.32,"Valid",13.172083333333331,20.7,"Valid",19.94458333333333,null,null,14.32,13.172083333333331,20.7,19.94458333333333,20.7,19.94458333333333,14.32,13.172083333333331]
{"$rows_left_out":665}