{"text_format":"1","workbook":"xlsx","n_sheets":7,"sheets":["Instructions","Meta data_sheet","Meta data_lookup","Raw data_sheet","Raw data_format","24hr_PM10_chart","24hr_PM2.5_chart"],"not_rendered":{"charts":4,"images":0,"macros":1,"external_links":0,"defined_names":10,"comments":0,"pivot_tables":0},"unopened":[{"sheet":"24hr_PM10_chart","index":5,"reason":"not_a_worksheet"},{"sheet":"24hr_PM2.5_chart","index":6,"reason":"not_a_worksheet"}],"bounds":{"document_bytes":16777216,"sheet_cells":100000,"rows_first":2000,"rows_last":500,"rows_between":2000,"halvings":0,"cell_chars":16384,"cell_head_chars":4096},"cells_cut":0,"cells_raw":0,"read":"whole","date_system":"1900"}

{"sheet":"Instructions","index":0,"n_rows":0,"n_cols":0,"rows_kept":0,"cut":false,"hidden":false,"merged":[]}

{"sheet":"Meta data_sheet","index":1,"n_rows":17,"n_cols":5,"rows_kept":17,"cut":false,"hidden":false,"merged":[[18,0,18,1],[16,0,16,1]]}
["Ambient Monitoring Station","Details",null,"Ambient Monitoring Results","Details"]
["Location","Werris Creek",null,"PM2.5 monitoring start (dd/mm/yyyy hh:mm)","2023-01-01"]
["Easting",{"$f":"VLOOKUP($B$2,'Meta data_lookup'!$A$2:$D$5,2,FALSE)","v":276783},null,"PM2.5 monitoring end","2023-01-23"]
["Northing",{"$f":"VLOOKUP($B$2,'Meta data_lookup'!$A$2:$D$5,3,FALSE)","v":6528734},null,"PM2.5 monitoring period (h)",{"$f":"(E3-E2)*24","v":528}]
["Site elevation (m)",{"$f":"VLOOKUP($B$2,'Meta data_lookup'!$A$2:$D$5,4,FALSE)","v":"ND"},null,"Number of valid PM2.5 results",{"$f":"COUNTIF('Raw data_sheet'!G2:G745,\"Valid\")","v":528}]
["Description of surrounding land use","Agriculture/Mining",null,"Proportion of valid PM2.5 results (%)",{"$f":"E5/E4","v":1}]
["Typical sources impacting on the site","Agriculture",null,"PM10 monitoring start (dd/mm/yyyy hh:mm)","2023-01-01"]
["Site compliance with AS/NZS 3580.1.1:2007","Yes",null,"PM10 monitoring end","2023-01-23"]
["PM2.5 method compliance with AS/NZS 3580.9.13:2013\n","Yes",null,"PM10 monitoring period (h)",{"$f":"(E8-E7)*24","v":528}]
["PM2.5 instrument make","Thermo Scientific",null,"Number of valid PM10 results",{"$f":"COUNTIF('Raw data_sheet'!J2:J745,\"Valid\")","v":528}]
["PM2.5 instrument model","1405DF",null,"Proportion of valid PM10 results (%)",{"$f":"E10/E9","v":1}]
["PM2.5 instrument intake height (m)",3.5]
["PM10 method compliance with AS 3580.9.8-2008\n","No*"]
["PM10 instrument make","Thermo Scientific"]
["PM10 instrument model","1405DF"]
["PM10 instrument intake height (m)",3.5]
["*The 1405DF TEOM used at this site measures PM10 indirectly rather than directly. The unit does however meet the intent of AS 3580.9.8-2008, and this method has been accredited by the USEPA. It is considered scientifically robust and is used extensively throughout NSW with EPA's knowledge and informal acceptance."]

{"sheet":"Meta data_lookup","index":2,"n_rows":5,"n_cols":4,"rows_kept":5,"cut":false,"hidden":false,"merged":[]}
["Location","Easting","Northing","Site elevation (m)"]
["Maules Creek",225302,6623037,"ND"]
["Breeza",237993,6542606,"ND"]
["Will-gai",231804,6596392,"ND"]
["Werris Creek",276783,6528734,"ND"]

{"sheet":"Raw data_sheet","index":3,"n_rows":745,"n_cols":21,"rows_kept":745,"cut":false,"hidden":false,"merged":[]}
["Year","Month","Day","Hour","Date and time","PM2.5_hourly","PM2.5_Data_Status","PM2.5_24hr_rolling_average","PM10_hourly","PM10_Data_Status","PM10_24hr_rolling_average","Cause of data invalidity, if applicable","Detailed comments","PM2.5_hourly_valid_plot","PM2.5_24hr_rolling_ave_valid_plot","PM10_hourly_valid_plot","PM10_24hr_rolling_ave_valid_plot","PM10_hourly_valid_plot_series","PM10_24hr_rolling_average_valid_plot_series","PM2.5_hourly_valid_plot_series","PM2.5_24hr_rolling_average_valid_plot_series"]
[2023,1,1,0,{"$f":"DATE(A2,B2,C2)+TIME(D2,0,0)","v":44927},3.7,"Valid",4.3,6.7,"Valid",8.5,null,null,{"$f":"IF(G2=\"Valid\", F2, NA())","v":3.7},{"$f":"IF(G2=\"Valid\", H2, NA())","v":4.3},{"$f":"IF(J2=\"Valid\", I2, NA())","v":6.7},{"$f":"IF(J2=\"Valid\", K2, NA())","v":8.5},6.7,8.5,3.7,4.3]
[{"$f":"A2","v":2023},{"$f":"B2","v":1},{"$f":"C2","v":1},{"$f":"IF(D2=23,0,D2+1)","v":1},{"$f":"E2+0.0416666666666666","v":44927.041666666664},4.0999999999999996,"Valid",4.3,7.3,"Valid",8.5,null,null,4.0999999999999996,4.3,7.3,8.5,7.3,8.5,4.0999999999999996,4.3]
[{"$f":"A3","v":2023},{"$f":"B3","v":1},1,{"$f":"IF(D3=23,0,D3+1)","v":2},{"$f":"E3+0.0416666666666666","v":44927.083333333328},2.9,"Valid",4.2,5.9,"Valid",8.3000000000000007,null,null,2.9,4.2,5.9,8.3000000000000007,5.9,8.3000000000000007,2.9,4.2]
[2023,1,1,3,44927.124999999993,3.7,"Valid",4.2,6.5,"Valid",8.1999999999999993,null,null,3.7,4.2,6.5,8.1999999999999993,6.5,8.1999999999999993,3.7,4.2]
[2023,1,1,4,44927.166666666657,4.0999999999999996,"Valid",4.0999999999999996,7.5,"Valid",8,null,null,4.0999999999999996,4.0999999999999996,7.5,8,7.5,8,4.0999999999999996,4.0999999999999996]
[2023,1,1,5,44927.208333333321,5.0999999999999996,"Valid",4,8.8000000000000007,"Valid",8,null,null,5.0999999999999996,4,8.8000000000000007,8,8.8000000000000007,8,5.0999999999999996,4]
[2023,1,1,6,44927.249999999985,6.4,"Valid",4.2,10.5,"Valid",8.1,null,null,6.4,4.2,10.5,8.1,10.5,8.1,6.4,4.2]
[2023,1,1,7,44927.29166666665,0.1,"Valid",4,4.4000000000000004,"Valid",8,null,null,0.1,4,4.4000000000000004,8,4.4000000000000004,8,0.1,4]
[2023,1,1,8,44927.333333333314,7.5,"Valid",4.3,11,"Valid",8.3000000000000007,null,null,7.5,4.3,11,8.3000000000000007,11,8.3000000000000007,7.5,4.3]
[2023,1,1,9,44927.374999999978,-2.6,"Valid",4.3,0.3,"Valid",8.4,null,null,-2.6,4.3,0.3,8.4,0.3,8.4,-2.6,4.3]
[2023,1,1,10,44927.416666666642,3,"Valid",4.4000000000000004,5.5,"Valid",8.6,null,null,3,4.4000000000000004,5.5,8.6,5.5,8.6,3,4.4000000000000004]
[2023,1,1,11,44927.458333333307,4.5999999999999996,"Valid",4.5999999999999996,7.7,"Valid",8.6999999999999993,null,null,4.5999999999999996,4.5999999999999996,7.7,8.6999999999999993,7.7,8.6999999999999993,4.5999999999999996,4.5999999999999996]
[2023,1,1,12,44927.499999999971,6.7,"Valid",4.9000000000000004,9.9,"Valid",9,null,null,6.7,4.9000000000000004,9.9,9,9.9,9,6.7,4.9000000000000004]
[2023,1,1,13,44927.541666666635,6.1,"Valid",4.8,10.6,"Valid",8.9,null,null,6.1,4.8,10.6,8.9,10.6,8.9,6.1,4.8]
[2023,1,1,14,44927.583333333299,8.1999999999999993,"Valid",4.8,12,"Valid",8.6999999999999993,null,null,8.1999999999999993,4.8,12,8.6999999999999993,12,8.6999999999999993,8.1999999999999993,4.8]
[2023,1,1,15,44927.624999999964,8,"Valid",4.9000000000000004,12.3,"Valid",8.8000000000000007,null,null,8,4.9000000000000004,12.3,8.8000000000000007,12.3,8.8000000000000007,8,4.9000000000000004]
[2023,1,1,16,44927.666666666628,6.3,"Valid",5,9.6,"Valid",8.9,null,null,6.3,5,9.6,8.9,9.6,8.9,6.3,5]
[2023,1,1,17,44927.708333333292,7.7,"Valid",5,10.4,"Valid",8.9,null,null,7.7,5,10.4,8.9,10.4,8.9,7.7,5]
[2023,1,1,18,44927.749999999956,3.7,"Valid",4.9000000000000004,6.5,"Valid",8.6999999999999993,null,null,3.7,4.9000000000000004,6.5,8.6999999999999993,6.5,8.6999999999999993,3.7,4.9000000000000004]
[2023,1,1,19,44927.791666666621,5.2,"Valid",4.9000000000000004,9,"Valid",8.6999999999999993,null,null,5.2,4.9000000000000004,9,8.6999999999999993,9,8.6999999999999993,5.2,4.9000000000000004]
[2023,1,1,20,44927.833333333285,3.7,"Valid",4.8,6.6,"Valid",8.5,null,null,3.7,4.8,6.6,8.5,6.6,8.5,3.7,4.8]
[2023,1,1,21,44927.874999999949,5,"Valid",4.7,7.5,"Valid",8.1999999999999993,null,null,5,4.7,7.5,8.1999999999999993,7.5,8.1999999999999993,5,4.7]
[2023,1,1,22,44927.916666666613,5.9,"Valid",4.7,23,"Valid",8.6999999999999993,null,null,5.9,4.7,23,8.6999999999999993,23,8.6999999999999993,5.9,4.7]
[2023,{"$f":"B24","v":1},{"$f":"C24","v":1},23,44927.958333333278,2.2999999999999998,"Valid",4.5999999999999996,4.5999999999999996,"Valid",8.4,null,null,2.2999999999999998,4.5999999999999996,4.5999999999999996,8.4,4.5999999999999996,8.4,2.2999999999999998,4.5999999999999996]
[2023,{"$f":"B25","v":1},{"$f":"C2+1","v":2},0,44927.999999999942,0.4,"Valid",4.4000000000000004,3.8,"Valid",8.3000000000000007,null,null,0.4,4.4000000000000004,3.8,8.3000000000000007,3.8,8.3000000000000007,0.4,4.4000000000000004]
[2023,{"$f":"B26","v":1},{"$f":"C3+1","v":2},1,44928.041666666606,4.5999999999999996,"Valid",4.4000000000000004,6.2,"Valid",8.1999999999999993,null,null,4.5999999999999996,4.4000000000000004,6.2,8.1999999999999993,6.2,8.1999999999999993,4.5999999999999996,4.4000000000000004]
[2023,1,2,2,44928.08333333327,2.9,"Valid",4.5,5.4,"Valid",8.1999999999999993,null,null,2.9,4.5,5.4,8.1999999999999993,5.4,8.1999999999999993,2.9,4.5]
[2023,1,2,3,44928.124999999935,1.9,"Valid",4.4000000000000004,5,"Valid",8.1,null,null,1.9,4.4000000000000004,5,8.1,5,8.1,1.9,4.4000000000000004]
[2023,1,2,4,44928.166666666599,2.6,"Valid",4.3,5.0999999999999996,"Valid",8,null,null,2.6,4.3,5.0999999999999996,8,5.0999999999999996,8,2.6,4.3]
[2023,1,2,5,44928.208333333263,0.4,"Valid",4.0999999999999996,3.4,"Valid",7.7,null,null,0.4,4.0999999999999996,3.4,7.7,3.4,7.7,0.4,4.0999999999999996]
[2023,1,2,6,44928.249999999927,4.0999999999999996,"Valid",4,6.1,"Valid",7.5,null,null,4.0999999999999996,4,6.1,7.5,6.1,7.5,4.0999999999999996,4]
[2023,1,2,7,44928.291666666591,3.7,"Valid",4.2,6.8,"Valid",7.7,null,null,3.7,4.2,6.8,7.7,6.8,7.7,3.7,4.2]
[2023,1,2,8,44928.333333333256,1.7,"Valid",4,4.5999999999999996,"Valid",7.5,null,null,1.7,4,4.5999999999999996,7.5,4.5999999999999996,7.5,1.7,4]
[2023,1,2,9,44928.37499999992,0.8,"Valid",4.0999999999999996,3.9,"Valid",7.7,null,null,0.8,4.0999999999999996,3.9,7.7,3.9,7.7,0.8,4.0999999999999996]
[2023,1,2,10,44928.416666666584,2.7,"Valid",4.0999999999999996,5.0999999999999996,"Valid",7.7,null,null,2.7,4.0999999999999996,5.0999999999999996,7.7,5.0999999999999996,7.7,2.7,4.0999999999999996]
[2023,1,2,11,44928.458333333248,1.4,"Valid",4,4.8,"Valid",7.6,null,null,1.4,4,4.8,7.6,4.8,7.6,1.4,4]
[2023,1,2,12,44928.499999999913,1.8,"Valid",3.8,5.4,"Valid",7.5,null,null,1.8,3.8,5.4,7.5,5.4,7.5,1.8,3.8]
[2023,1,2,13,44928.541666666577,2.9,"Valid",3.7,6.2,"Valid",7.3,null,null,2.9,3.7,6.2,7.3,6.2,7.3,2.9,3.7]
[2023,1,2,14,44928.583333333241,6.2,"Valid",3.7,14,"Valid",7.4,null,null,6.2,3.7,14,7.4,14,7.4,6.2,3.7]
[2023,1,2,15,44928.624999999905,3.8,"Valid",3.5,8.3000000000000007,"Valid",7.3,null,null,3.8,3.5,8.3000000000000007,7.3,8.3000000000000007,7.3,3.8,3.5]
[2023,1,2,16,44928.66666666657,6.7,"Valid",3.5,9.1,"Valid",7.3,null,null,6.7,3.5,9.1,7.3,9.1,7.3,6.7,3.5]
[2023,1,2,17,44928.708333333234,5.4,"Valid",3.4,8.4,"Valid",7.2,null,null,5.4,3.4,8.4,7.2,8.4,7.2,5.4,3.4]
[2023,1,2,18,44928.749999999898,9,"Valid",3.6,12,"Valid",7.4,null,null,9,3.6,12,7.4,12,7.4,9,3.6]
[2023,1,2,19,44928.791666666562,8.3000000000000007,"Valid",3.8,11.6,"Valid",7.5,null,null,8.3000000000000007,3.8,11.6,7.5,11.6,7.5,8.3000000000000007,3.8]
[2023,1,2,20,44928.833333333227,12.8,"Valid",4.0999999999999996,16,"Valid",7.8,null,null,12.8,4.0999999999999996,16,7.8,16,7.8,12.8,4.0999999999999996]
[2023,1,2,21,44928.874999999891,12.8,"Valid",4.4000000000000004,17.399999999999999,"Valid",8.1999999999999993,null,null,{"$f":"IF(G47=\"Valid\", F47, NA())","v":12.8},{"$f":"IF(G47=\"Valid\", H47, NA())","v":4.4000000000000004},17.399999999999999,8.1999999999999993,17.399999999999999,8.1999999999999993,12.8,4.4000000000000004]
[2023,1,2,22,44928.916666666555,8.6999999999999993,"Valid",4.5,13.5,"Valid",7.7,null,null,8.6999999999999993,4.5,13.5,7.7,13.5,7.7,8.6999999999999993,4.5]
[2023,1,2,23,44928.958333333219,8.5,"Valid",4.7,15.7,"Valid",8.1999999999999993,null,null,8.5,4.7,15.7,8.1999999999999993,15.7,8.1999999999999993,8.5,4.7]
[2023,1,3,0,44928.999999999884,9.6999999999999993,"Valid",5.0999999999999996,14.2,"Valid",8.6,null,null,9.6999999999999993,5.0999999999999996,14.2,8.6,14.2,8.6,9.6999999999999993,5.0999999999999996]
[2023,1,3,1,44929.041666666548,7.3,"Valid",5.2,11.1,"Valid",8.8000000000000007,null,null,7.3,5.2,11.1,8.8000000000000007,11.1,8.8000000000000007,7.3,5.2]
[2023,1,3,2,44929.083333333212,4.5999999999999996,"Valid",5.3,10,"Valid",9,null,null,4.5999999999999996,5.3,10,9,10,9,4.5999999999999996,5.3]
[2023,1,3,3,44929.124999999876,12.1,"Valid",5.7,17.2,"Valid",9.5,null,null,12.1,5.7,17.2,9.5,17.2,9.5,12.1,5.7]
[2023,1,3,4,44929.166666666541,10.9,"Valid",6,17.100000000000001,"Valid",10,null,null,10.9,6,17.100000000000001,10,17.100000000000001,10,10.9,6]
[2023,1,3,5,44929.208333333205,4.9000000000000004,"Valid",6.2,11.4,"Valid",10.3,null,null,4.9000000000000004,6.2,11.4,10.3,11.4,10.3,4.9000000000000004,6.2]
[2023,1,3,6,44929.249999999869,7.6,"Valid",6.3,11.1,"Valid",10.5,null,null,7.6,6.3,11.1,10.5,11.1,10.5,7.6,6.3]
[2023,1,3,7,44929.291666666533,4.7,"Valid",6.4,11.3,"Valid",10.7,null,null,4.7,6.4,11.3,10.7,11.3,10.7,4.7,6.4]
[2023,1,3,8,44929.333333333198,9.6999999999999993,"Valid",6.8,15.4,"Valid",11.2,null,null,9.6999999999999993,6.8,15.4,11.2,15.4,11.2,9.6999999999999993,6.8]
[2023,1,3,9,44929.374999999862,8.5,"Valid",7.1,14.6,"Valid",11.7,null,null,8.5,7.1,14.6,11.7,14.6,11.7,8.5,7.1]
[2023,1,3,10,44929.416666666526,4.5,"Valid",7.2,11.9,"Valid",12,null,null,4.5,7.2,11.9,12,11.9,12,4.5,7.2]
[2023,1,3,11,44929.45833333319,-0.2,"Valid",7.2,9.6999999999999993,"Valid",12.3,null,null,-0.2,7.2,9.6999999999999993,12.3,9.6999999999999993,12.3,-0.2,7.2]
[2023,1,3,12,44929.499999999854,8.1999999999999993,"Valid",7.5,16.399999999999999,"Valid",12.8,null,null,8.1999999999999993,7.5,16.399999999999999,12.8,16.399999999999999,12.8,8.1999999999999993,7.5]
[2023,1,3,13,44929.541666666519,9.8000000000000007,"Valid",7.8,15.7,"Valid",13.2,null,null,9.8000000000000007,7.8,15.7,13.2,15.7,13.2,9.8000000000000007,7.8]
[2023,1,3,14,44929.583333333183,8,"Valid",7.9,15,"Valid",13.3,null,null,8,7.9,15,13.3,15,13.3,8,7.9]
[2023,1,3,15,44929.624999999847,10.3,"Valid",8.1999999999999993,16.7,"Valid",13.8,null,null,10.3,8.1999999999999993,16.7,13.8,16.7,13.8,10.3,8.1999999999999993]
[2023,1,3,16,44929.666666666511,9.8000000000000007,"Valid",8.3000000000000007,16.600000000000001,"Valid",14.1,null,null,9.8000000000000007,8.3000000000000007,{"$f":"IF(J66=\"Valid\", I66, NA())","v":16.600000000000001},{"$f":"IF(J66=\"Valid\", K66, NA())","v":14.1},16.600000000000001,14.1,9.8000000000000007,8.3000000000000007]
[2023,1,3,17,44929.708333333176,6.6,"Valid",8.4,12.5,"Valid",14.3,null,null,6.6,8.4,12.5,14.3,12.5,14.3,6.6,8.4]
[{"$f":"A67","v":2023},1,3,{"$f":"IF(D67=23,0,D67+1)","v":18},{"$f":"E67+0.0416666666666666","v":44929.74999999984},9.8000000000000007,"Valid",8.4,15.4,"Valid",14.4,null,null,9.8000000000000007,8.4,15.4,14.4,15.4,14.4,9.8000000000000007,8.4]
[2023,1,3,19,44929.791666666504,5.8,"Valid",8.3000000000000007,13,"Valid",14.5,null,null,5.8,8.3000000000000007,13,14.5,13,14.5,5.8,8.3000000000000007]
[2023,1,3,20,44929.833333333168,7.5,"Valid",8,19.100000000000001,"Valid",14.4,null,null,7.5,8,19.100000000000001,14.4,19.100000000000001,14.4,7.5,8]
[2023,1,3,21,44929.874999999833,12.2,"Valid",7.9,17.899999999999999,"Valid",14.3,null,null,12.2,7.9,17.899999999999999,14.3,17.899999999999999,14.3,12.2,7.9]
[2023,1,3,22,44929.916666666497,10.7,"Valid",8,17.3,"Valid",14.4,null,null,10.7,8,17.3,14.4,17.3,14.4,10.7,8]
[2023,1,3,23,44929.958333333161,12.2,"Valid",8.1,19.100000000000001,"Valid",14.5,null,null,12.2,8.1,19.100000000000001,14.5,19.100000000000001,14.5,12.2,8.1]
[2023,1,4,0,44929.999999999825,10.3,"Valid",8.1,17.600000000000001,"Valid",14.6,null,null,{"$f":"IF(G74=\"Valid\", F74, NA())","v":10.3},{"$f":"IF(G74=\"Valid\", H74, NA())","v":8.1},17.600000000000001,14.6,17.600000000000001,14.6,10.3,8.1]
[2023,1,4,1,44930.04166666649,11.9,"Valid",8.3000000000000007,17.2,"Valid",14.8,null,null,11.9,8.3000000000000007,17.2,14.8,17.2,14.8,11.9,8.3000000000000007]
[2023,1,4,2,44930.083333333154,8.3000000000000007,"Valid",8.4,13.1,"Valid",14.9,null,null,8.3000000000000007,8.4,13.1,14.9,13.1,14.9,8.3000000000000007,8.4]
[2023,1,4,3,44930.124999999818,6.1,"Valid",8.1999999999999993,11.6,"Valid",14.7,null,null,6.1,8.1999999999999993,11.6,14.7,11.6,14.7,6.1,8.1999999999999993]
[2023,1,4,4,44930.166666666482,9.1,"Valid",8,15.4,"Valid",14.6,null,null,9.1,8,15.4,14.6,15.4,14.6,9.1,8]
[2023,1,4,5,44930.208333333147,9,"Valid",8.1999999999999993,17.899999999999999,"Valid",14.8,null,null,9,8.1999999999999993,17.899999999999999,14.8,17.899999999999999,14.8,9,8.1999999999999993]
[2023,1,4,6,44930.249999999811,8,"Valid",8.1999999999999993,15.5,"Valid",15,null,null,8,8.1999999999999993,15.5,15,15.5,15,8,8.1999999999999993]
[2023,1,4,7,44930.291666666475,9.3000000000000007,"Valid",8.4,20,"Valid",15.3,null,null,9.3000000000000007,8.4,20,15.3,20,15.3,9.3000000000000007,8.4]
[2023,1,4,8,44930.333333333139,1.3,"Valid",8.1999999999999993,8.3000000000000007,"Valid",15.3,null,null,1.3,8.1999999999999993,8.3000000000000007,15.3,8.3000000000000007,15.3,1.3,8.1999999999999993]
[2023,1,4,9,44930.374999999804,4.8,"Valid",8.1,10.4,"Valid",15.2,null,null,4.8,8.1,10.4,15.2,10.4,15.2,4.8,8.1]
[2023,1,4,10,44930.416666666468,7.9,"Valid",8.3000000000000007,14.8,"Valid",15.4,null,null,7.9,8.3000000000000007,14.8,15.4,14.8,15.4,7.9,8.3000000000000007]
[2023,1,4,11,44930.458333333132,4.9000000000000004,"Valid",8.5,12,"Valid",15.5,null,null,4.9000000000000004,8.5,12,15.5,12,15.5,4.9000000000000004,8.5]
[2023,1,4,12,44930.499999999796,9.1,"Valid",8.6,18.100000000000001,"Valid",15.7,null,null,9.1,8.6,18.100000000000001,15.7,18.100000000000001,15.7,9.1,8.6]
[2023,1,4,13,44930.541666666461,3.1,"Valid",8.3000000000000007,10.6,"Valid",15.5,null,null,3.1,8.3000000000000007,10.6,15.5,10.6,15.5,3.1,8.3000000000000007]
[2023,1,4,14,44930.583333333125,11,"Valid",8.4,20.100000000000001,"Valid",15.7,null,null,11,8.4,20.100000000000001,15.7,20.100000000000001,15.7,11,8.4]
[2023,1,4,15,44930.624999999789,13.3,"Valid",8.6,33.200000000000003,"Valid",16.399999999999999,null,null,13.3,8.6,33.200000000000003,16.399999999999999,33.200000000000003,16.399999999999999,13.3,8.6]
[2023,1,4,16,44930.666666666453,7.4,"Valid",8.5,16.600000000000001,"Valid",16.399999999999999,null,null,7.4,8.5,16.600000000000001,16.399999999999999,16.600000000000001,16.399999999999999,7.4,8.5]
[2023,{"$f":"B90","v":1},{"$f":"C67+1","v":4},17,44930.708333333117,10.3,"Valid",8.6999999999999993,31.8,"Valid",17.3,null,null,10.3,8.6999999999999993,31.8,17.3,31.8,17.3,10.3,8.6999999999999993]
[2023,1,4,18,44930.749999999782,11.3,"Valid",8.6999999999999993,19.100000000000001,"Valid",17.3,null,null,11.3,8.6999999999999993,19.100000000000001,17.3,19.100000000000001,17.3,11.3,8.6999999999999993]
[2023,1,4,19,44930.791666666446,7.3,"Valid",8.6,14,"Valid",17.2,null,null,7.3,8.6,14,17.2,14,17.2,7.3,8.6]
[2023,1,4,20,44930.83333333311,12.7,"Valid",8.8000000000000007,18.899999999999999,"Valid",17.100000000000001,null,null,12.7,8.8000000000000007,18.899999999999999,17.100000000000001,18.899999999999999,17.100000000000001,12.7,8.8000000000000007]
[2023,1,4,21,44930.874999999774,10.7,"Valid",8.6999999999999993,16,"Valid",16.899999999999999,null,null,10.7,8.6999999999999993,16,16.899999999999999,16,16.899999999999999,10.7,8.6999999999999993]
[2023,1,4,22,44930.916666666439,9.9,"Valid",8.6,14.8,"Valid",16.7,null,null,9.9,8.6,14.8,16.7,14.8,16.7,9.9,8.6]
[2023,1,4,23,44930.958333333103,11.4,"Valid",8.6,16.5,"Valid",16.600000000000001,null,null,11.4,8.6,16.5,16.600000000000001,16.5,16.600000000000001,11.4,8.6]
[2023,1,5,0,44930.999999999767,5.7,"Valid",8.4,10.5,"Valid",16.2,null,null,5.7,8.4,10.5,16.2,10.5,16.2,5.7,8.4]
[2023,1,5,1,44931.041666666431,5.6,"Valid",8.1,9.6,"Valid",15.9,null,null,5.6,8.1,9.6,15.9,9.6,15.9,5.6,8.1]
[2023,1,5,2,44931.083333333096,1.8,"Valid",7.8,4.2,"Valid",15.5,null,null,1.8,7.8,4.2,15.5,4.2,15.5,1.8,7.8]
[2023,1,5,3,44931.12499999976,7.3,"Valid",7.8,10.3,"Valid",15.4,null,null,7.3,7.8,10.3,15.4,10.3,15.4,7.3,7.8]
[2023,1,5,4,44931.166666666424,1.5,"Valid",7.5,4.7,"Valid",15,null,null,1.5,7.5,4.7,15,4.7,15,1.5,7.5]
[2023,1,5,5,44931.208333333088,2,"Valid",7.2,4.9000000000000004,"Valid",14.4,null,null,2,7.2,4.9000000000000004,14.4,4.9000000000000004,14.4,2,7.2]
[2023,1,5,6,44931.249999999753,5.6,"Valid",7.1,8.3000000000000007,"Valid",14.1,null,null,5.6,7.1,8.3000000000000007,14.1,8.3000000000000007,14.1,5.6,7.1]
[2023,1,5,7,44931.291666666417,3.7,"Valid",6.9,7.1,"Valid",13.6,null,null,3.7,6.9,7.1,13.6,7.1,13.6,3.7,6.9]
[2023,1,5,8,44931.333333333081,-2.1,"Valid",6.8,0.9,"Valid",13.3,null,null,-2.1,6.8,0.9,13.3,0.9,13.3,-2.1,6.8]
[2023,1,5,9,44931.374999999745,0.3,"Valid",6.6,3.3,"Valid",13,null,null,0.3,6.6,3.3,13,3.3,13,0.3,6.6]
[2023,1,5,10,44931.41666666641,2.2999999999999998,"Valid",6.4,6.6,"Valid",12.7,null,null,2.2999999999999998,6.4,6.6,12.7,6.6,12.7,2.2999999999999998,6.4]
[2023,1,5,11,44931.458333333074,-2.9,"Valid",6.1,1.5,"Valid",12.4,null,null,-2.9,6.1,1.5,12.4,1.5,12.4,-2.9,6.1]
[2023,1,5,12,44931.499999999738,2.4,"Valid",5.8,5.8,"Valid",11.9,null,null,2.4,5.8,5.8,11.9,5.8,11.9,2.4,5.8]
[2023,1,5,13,44931.541666666402,4.5999999999999996,"Valid",5.9,7.5,"Valid",11.8,null,null,4.5999999999999996,5.9,7.5,11.8,7.5,11.8,4.5999999999999996,5.9]
[2023,1,5,14,44931.583333333067,9.1,"Valid",5.9,12.7,"Valid",11.6,null,null,9.1,5.9,12.7,11.6,12.7,11.6,9.1,5.9]
[2023,1,5,15,44931.624999999731,5,"Valid",5.5,10.3,"Valid",10.6,null,null,5,5.5,10.3,10.6,10.3,10.6,5,5.5]
[2023,1,5,16,44931.666666666395,3.7,"Valid",5.4,7.8,"Valid",10.3,null,null,3.7,5.4,7.8,10.3,7.8,10.3,3.7,5.4]
[2023,1,5,17,44931.708333333059,6.4,"Valid",5.2,10.3,"Valid",9.4,null,null,6.4,5.2,10.3,9.4,10.3,9.4,6.4,5.2]
[2023,1,5,18,44931.749999999724,6.4,"Valid",5,10.199999999999999,"Valid",9,null,null,6.4,5,10.199999999999999,9,10.199999999999999,9,6.4,5]
[2023,1,5,19,44931.791666666388,7.2,"Valid",4.9000000000000004,12.6,"Valid",8.9,null,null,7.2,4.9000000000000004,12.6,8.9,12.6,8.9,7.2,4.9000000000000004]
[2023,1,5,20,44931.833333333052,3.4,"Valid",4.5,8.3000000000000007,"Valid",8.4,null,null,3.4,4.5,8.3000000000000007,8.4,8.3000000000000007,8.4,3.4,4.5]
[2023,1,5,21,44931.874999999716,2.8,"Valid",4.2,7.6,"Valid",8,null,null,2.8,4.2,7.6,8,7.6,8,2.8,4.2]
[2023,1,5,22,44931.91666666638,7.5,"Valid",4.0999999999999996,13.3,"Valid",7.9,null,null,7.5,4.0999999999999996,13.3,7.9,13.3,7.9,7.5,4.0999999999999996]
{"$rows_left_out":626}
{"sheet":"Raw data_format","index":4,"n_rows":8,"n_cols":6,"rows_kept":8,"cut":false,"hidden":false,"merged":[]}
["Parameter","Format","Comment","Units of measure","Minimum","Maximum"]
["Year","yyyy","4 integer format","Not applicable",2015,"Until reporting ceases"]
["Month","mm","2 integer format","Not applicable",1,12]
["Day","dd","2 integer format","Not applicable",1,31]
["Hour","hh","2 integer format","Not applicable",0,23]
["PM10",0,"1 decimal place resolution","µg/m3","Negative","Instrument specific"]
["PM2.5",0,"2 decimal place resolution","µg/m3","Negative","Instrument specific"]
["Status","Text","7 character format","Not applicable","Valid","Invalid"]